CI Infrastructure Status - tcwg_bootstrap_build.html

date = 2026-10-23 01:03:00.262877

config = CI-TCWG.yaml

LINKS

SUMMARY_TABLE (Last completed build only)

statistics on last-completed build of all jenkins job

last_run_date #success #failure #regressed
anytime 16 0 0
last-week 16 0 0
6-days-ago 0 0 0
5-days-ago 0 0 0
4-days-ago 0 0 0
3-days-ago 3 0 0
2-days-ago 13 0 0
1-days-ago 0 0 0
0-days-ago 0 0 0

SUMMARY_TABLE (All completed runs)

statistics on all completed builds of all jenkins job

last_run_date #success #failure #regressed #forced #reducing #aborted
anytime 155 69 0 12 6 0
last-week 82 0 0 12 6 0
6-days-ago 10 0 0 4 2 0
5-days-ago 14 0 0 4 2 0
4-days-ago 20 0 0 2 2 0
3-days-ago 13 0 0 0 0 0
2-days-ago 13 0 0 0 0 0
1-days-ago 0 0 0 0 0 0
0-days-ago 0 0 0 0 0 0

DETAILS_TABLE

help for the table format : here
project status last_build notify_verif last_success last_fail last_forced artifact_version statistics
tcwg_bootstrap_build--master-aarch64-bootstrap_debug-build SUCCESS (none) 02days 15hrs ago : #10209-gcc-R1 artifacts/results/ email/jira/ log/status 02days 15hrs ago : #10209-gcc-R1 09days 18hrs ago : #10202 never 6.0 regressed(00%) force(00%) fail(33%) ok(66%) skip(00%) nbruns=15
tcwg_bootstrap_build--master-aarch64-bootstrap_lto-build SUCCESS (none) 02days 10hrs ago : #10202-gcc-R1 artifacts/results/ email/jira/ log/status 02days 10hrs ago : #10202-gcc-R1 09days 18hrs ago : #10194 never 6.0 regressed(00%) force(00%) fail(25%) ok(75%) skip(00%) nbruns=16
tcwg_bootstrap_build--master-aarch64-bootstrap_O1-build SUCCESS (none) 02days 11hrs ago : #10198-gcc-R1 artifacts/results/ email/jira/ log/status 02days 11hrs ago : #10198-gcc-R1 09days 18hrs ago : #10190 never 6.0 regressed(00%) force(00%) fail(31%) ok(68%) skip(00%) nbruns=16
tcwg_bootstrap_build--master-aarch64-bootstrap_O3-build SUCCESS (none) 01days 23hrs ago : #10199-gcc-R1 artifacts/results/ email/jira/ log/status 01days 23hrs ago : #10199-gcc-R1 09days 18hrs ago : #10191 never 6.0 regressed(00%) force(00%) fail(26%) ok(66%) skip(00%) nbruns=15
tcwg_bootstrap_build--master-aarch64-bootstrap_profiled-build SUCCESS (none) 01days 19hrs ago : #10199-gcc-R1 artifacts/results/ email/jira/ log/status 01days 19hrs ago : #10199-gcc-R1 09days 18hrs ago : #10191 never 6.0 regressed(00%) force(00%) fail(31%) ok(68%) skip(00%) nbruns=16
tcwg_bootstrap_build--master-aarch64-bootstrap_profiled_lto-build SUCCESS (none) 02days 12hrs ago : #10198-gcc-R1 artifacts/results/ email/jira/ log/status 02days 12hrs ago : #10198-gcc-R1 09days 18hrs ago : #10191 never 6.0 regressed(13%) force(00%) fail(33%) ok(53%) skip(00%) nbruns=15
tcwg_bootstrap_build--master-aarch64-bootstrap_profiled_lto_lean-build SUCCESS (none) 02days 05hrs ago : #10198-gcc-R1 artifacts/results/ email/jira/ log/status 02days 05hrs ago : #10198-gcc-R1 09days 18hrs ago : #10190 never 6.0 regressed(00%) force(00%) fail(26%) ok(73%) skip(00%) nbruns=15
tcwg_bootstrap_build--master-aarch64-bootstrap_ubsan-build SUCCESS (none) 02days 04hrs ago : #10204-gcc-R1 artifacts/results/ email/jira/ log/status 02days 04hrs ago : #10204-gcc-R1 09days 18hrs ago : #10196 never 6.0 regressed(06%) force(00%) fail(26%) ok(66%) skip(00%) nbruns=15
tcwg_bootstrap_build--master-arm-bootstrap_debug-build SUCCESS (none) 02days 11hrs ago : #10201-gcc-R# FAILED artifacts/results/ email/jira/ log/status 02days 11hrs ago : #10201-gcc-R# FAILED 07days 09hrs ago : #10193-skip-scm-build 06days 15hrs ago : #10195-gcc-R# 00:23:12 make: *** [Makefile:1139: all] Error 2-force (bisect : gcc-53bcce7) 6.0 regressed(05%) force(10%) fail(26%) ok(52%) skip(05%) nbruns=19
tcwg_bootstrap_build--master-arm-bootstrap_lto-build SUCCESS (none) 02days 05hrs ago : #10202-gcc-R# FAILED artifacts/results/ email/jira/ log/status 02days 05hrs ago : #10202-gcc-R# FAILED 04days 16hrs ago : #10196-skip-scm-build 04days 04hrs ago : #10198-gcc-R# 00:42:32 make: *** [Makefile:1139: all] Error 2-force (bisect : gcc-78f0a4e) 6.0 regressed(05%) force(11%) fail(23%) ok(52%) skip(05%) nbruns=17
tcwg_bootstrap_build--master-arm-bootstrap_O1-build SUCCESS (none) 02days 08hrs ago : #10198-gcc-R1 artifacts/results/ email/jira/ log/status 02days 08hrs ago : #10198-gcc-R1 17days 14hrs ago : #10186 never 6.0 regressed(00%) force(00%) fail(20%) ok(80%) skip(00%) nbruns=15
tcwg_bootstrap_build--master-arm-bootstrap_O3-build SUCCESS (none) 01days 23hrs ago : #10205-gcc-R# FAILED artifacts/results/ email/jira/ log/status 01days 23hrs ago : #10205-gcc-R# FAILED 05days 08hrs ago : #10198-skip-scm-build 04days 17hrs ago : #10200-gcc-R# 00:25:15 make: *** [Makefile:1139: all] Error 2-force (bisect : gcc-53bcce7) 6.0 regressed(05%) force(11%) fail(23%) ok(52%) skip(05%) nbruns=17
tcwg_bootstrap_build--master-arm-bootstrap_profiled-build SUCCESS (none) 02days 03hrs ago : #10201-gcc-R# FAILED artifacts/results/ email/jira/ log/status 02days 03hrs ago : #10201-gcc-R# FAILED 05days 18hrs ago : #10194-skip-scm-build 05days 03hrs ago : #10196-gcc-R# 00:31:10 make: *** [Makefile:27333: profiledbootstrap] Error 2-force (bisect : gcc-53bcce7) 6.0 regressed(05%) force(11%) fail(23%) ok(52%) skip(05%) nbruns=17
tcwg_bootstrap_build--master-arm-bootstrap_profiled_lto-build SUCCESS (none) 02days 10hrs ago : #10206-gcc-R# FAILED artifacts/results/ email/jira/ log/status 02days 10hrs ago : #10206-gcc-R# FAILED 06days 12hrs ago : #10199-skip-scm-build 05days 23hrs ago : #10201-gcc-R# 00:55:52 make: *** [Makefile:27333: profiledbootstrap] Error 2-force (bisect : gcc-53bcce7) 6.0 regressed(05%) force(11%) fail(22%) ok(55%) skip(05%) nbruns=18
tcwg_bootstrap_build--master-arm-bootstrap_profiled_lto_lean-build SUCCESS (none) 02days 04hrs ago : #10202-gcc-R# FAILED artifacts/results/ email/jira/ log/status 02days 04hrs ago : #10202-gcc-R# FAILED 06days 02hrs ago : #10195-skip-scm-build 05days 14hrs ago : #10197-gcc-R# 00:31:16 make: *** [Makefile:27333: profiledbootstrap] Error 2-force (bisect : gcc-53bcce7) 6.0 regressed(05%) force(11%) fail(23%) ok(52%) skip(05%) nbruns=17
tcwg_bootstrap_build--master-arm-bootstrap_ubsan-build SUCCESS (none) 02days 17hrs ago : #10201-gcc-R1 artifacts/results/ email/jira/ log/status 02days 17hrs ago : #10201-gcc-R1 09days 18hrs ago : #10194 never 6.0 regressed(00%) force(00%) fail(33%) ok(66%) skip(00%) nbruns=15

time to build html = 0:02:58.341023