CI Infrastructure Status - tcwg.html

date = 2026-10-22 23:42:24.813407

config = CI-TCWG.yaml

LINKS

SUMMARY_TABLE (Last completed build only)

statistics on last-completed build of all jenkins job

last_run_date #success #failure #regressed
anytime 69 3 0
last-week 69 3 0
6-days-ago 0 0 0
5-days-ago 0 0 0
4-days-ago 0 0 0
3-days-ago 8 2 0
2-days-ago 40 0 0
1-days-ago 12 0 0
0-days-ago 9 1 0

SUMMARY_TABLE (All completed runs)

statistics on all completed builds of all jenkins job

last_run_date #success #failure #regressed #forced #reducing #aborted
anytime 1288 737 0 256 43 1
last-week 662 94 0 125 16 1
6-days-ago 105 11 0 25 3 0
5-days-ago 93 19 0 19 5 1
4-days-ago 126 27 0 14 2 0
3-days-ago 101 15 0 13 2 0
2-days-ago 95 4 0 18 0 0
1-days-ago 37 5 0 11 1 0
0-days-ago 19 2 0 2 1 0

DETAILS_TABLE

help for the table format : here
project status last_build notify_verif last_success last_fail last_forced artifact_version statistics
tcwg_binutils_build--master-aarch64-build SUCCESS (none) 01days 21hrs ago : #10674-binutils-R1 artifacts/results/ email/jira/ log/status 01days 21hrs ago : #10674-binutils-R1 09days 17hrs ago : #10651 never 6.0 regressed(00%) force(00%) fail(31%) ok(68%) skip(00%) nbruns=47
tcwg_binutils_build--master-arm-build SUCCESS (none) 01days 21hrs ago : #10674-binutils-R1 artifacts/results/ email/jira/ log/status 01days 21hrs ago : #10674-binutils-R1 09days 17hrs ago : #10651 never 6.0 regressed(00%) force(00%) fail(31%) ok(68%) skip(00%) nbruns=47
tcwg_binutils_check--master-aarch64-build SUCCESS (none) 01days 18hrs ago : #10683-binutils-R0 artifacts/results/ email/jira/ log/status 01days 18hrs ago : #10683-binutils-R0 09days 16hrs ago : #10660 never 6.0 regressed(00%) force(00%) fail(31%) ok(68%) skip(00%) nbruns=47
tcwg_binutils_check--master-arm-build SUCCESS (none) 01days 18hrs ago : #10688-binutils-R0 artifacts/results/ email/jira/ log/status 01days 18hrs ago : #10688-binutils-R0 09days 16hrs ago : #10662 never 6.0 regressed(00%) force(00%) fail(28%) ok(72%) skip(00%) nbruns=50
tcwg_bootstrap_build--master-aarch64-bootstrap_debug-build SUCCESS (none) 02days 14hrs ago : #10209-gcc-R1 artifacts/results/ email/jira/ log/status 02days 14hrs ago : #10209-gcc-R1 09days 16hrs ago : #10202 never 6.0 regressed(00%) force(00%) fail(33%) ok(66%) skip(00%) nbruns=15
tcwg_bootstrap_build--master-aarch64-bootstrap_lto-build SUCCESS (none) 02days 08hrs ago : #10202-gcc-R1 artifacts/results/ email/jira/ log/status 02days 08hrs ago : #10202-gcc-R1 09days 16hrs ago : #10194 never 6.0 regressed(00%) force(00%) fail(25%) ok(75%) skip(00%) nbruns=16
tcwg_bootstrap_build--master-aarch64-bootstrap_O1-build SUCCESS (none) 02days 10hrs ago : #10198-gcc-R1 artifacts/results/ email/jira/ log/status 02days 10hrs ago : #10198-gcc-R1 09days 16hrs ago : #10190 never 6.0 regressed(00%) force(00%) fail(31%) ok(68%) skip(00%) nbruns=16
tcwg_bootstrap_build--master-aarch64-bootstrap_O3-build SUCCESS (none) 01days 21hrs ago : #10199-gcc-R1 artifacts/results/ email/jira/ log/status 01days 21hrs ago : #10199-gcc-R1 09days 16hrs ago : #10191 never 6.0 regressed(00%) force(00%) fail(26%) ok(66%) skip(00%) nbruns=15
tcwg_bootstrap_build--master-aarch64-bootstrap_profiled-build SUCCESS (none) 01days 18hrs ago : #10199-gcc-R1 artifacts/results/ email/jira/ log/status 01days 18hrs ago : #10199-gcc-R1 09days 16hrs ago : #10191 never 6.0 regressed(00%) force(00%) fail(31%) ok(68%) skip(00%) nbruns=16
tcwg_bootstrap_build--master-aarch64-bootstrap_profiled_lto-build SUCCESS (none) 02days 11hrs ago : #10198-gcc-R1 artifacts/results/ email/jira/ log/status 02days 11hrs ago : #10198-gcc-R1 09days 16hrs ago : #10191 never 6.0 regressed(13%) force(00%) fail(33%) ok(53%) skip(00%) nbruns=15
tcwg_bootstrap_build--master-aarch64-bootstrap_profiled_lto_lean-build SUCCESS (none) 02days 04hrs ago : #10198-gcc-R1 artifacts/results/ email/jira/ log/status 02days 04hrs ago : #10198-gcc-R1 09days 16hrs ago : #10190 never 6.0 regressed(00%) force(00%) fail(26%) ok(73%) skip(00%) nbruns=15
tcwg_bootstrap_build--master-aarch64-bootstrap_ubsan-build SUCCESS (none) 02days 03hrs ago : #10204-gcc-R1 artifacts/results/ email/jira/ log/status 02days 03hrs ago : #10204-gcc-R1 09days 16hrs ago : #10196 never 6.0 regressed(06%) force(00%) fail(26%) ok(66%) skip(00%) nbruns=15
tcwg_bootstrap_build--master-arm-bootstrap_debug-build SUCCESS (none) 02days 09hrs ago : #10201-gcc-R# FAILED artifacts/results/ email/jira/ log/status 02days 09hrs ago : #10201-gcc-R# FAILED 07days 07hrs ago : #10193-skip-scm-build 06days 13hrs ago : #10195-gcc-R# 00:23:12 make: *** [Makefile:1139: all] Error 2-force (bisect : gcc-53bcce7) 6.0 regressed(05%) force(10%) fail(26%) ok(52%) skip(05%) nbruns=19
tcwg_bootstrap_build--master-arm-bootstrap_lto-build SUCCESS (none) 02days 03hrs ago : #10202-gcc-R# FAILED artifacts/results/ email/jira/ log/status 02days 03hrs ago : #10202-gcc-R# FAILED 04days 15hrs ago : #10196-skip-scm-build 04days 03hrs ago : #10198-gcc-R# 00:42:32 make: *** [Makefile:1139: all] Error 2-force (bisect : gcc-78f0a4e) 6.0 regressed(05%) force(11%) fail(23%) ok(52%) skip(05%) nbruns=17
tcwg_bootstrap_build--master-arm-bootstrap_O1-build SUCCESS (none) 02days 06hrs ago : #10198-gcc-R1 artifacts/results/ email/jira/ log/status 02days 06hrs ago : #10198-gcc-R1 17days 12hrs ago : #10186 never 6.0 regressed(00%) force(00%) fail(20%) ok(80%) skip(00%) nbruns=15
tcwg_bootstrap_build--master-arm-bootstrap_O3-build SUCCESS (none) 01days 22hrs ago : #10205-gcc-R# FAILED artifacts/results/ email/jira/ log/status 01days 22hrs ago : #10205-gcc-R# FAILED 05days 06hrs ago : #10198-skip-scm-build 04days 15hrs ago : #10200-gcc-R# 00:25:15 make: *** [Makefile:1139: all] Error 2-force (bisect : gcc-53bcce7) 6.0 regressed(05%) force(11%) fail(23%) ok(52%) skip(05%) nbruns=17
tcwg_bootstrap_build--master-arm-bootstrap_profiled-build SUCCESS (none) 02days 02hrs ago : #10201-gcc-R# FAILED artifacts/results/ email/jira/ log/status 02days 02hrs ago : #10201-gcc-R# FAILED 05days 17hrs ago : #10194-skip-scm-build 05days 02hrs ago : #10196-gcc-R# 00:31:10 make: *** [Makefile:27333: profiledbootstrap] Error 2-force (bisect : gcc-53bcce7) 6.0 regressed(05%) force(11%) fail(23%) ok(52%) skip(05%) nbruns=17
tcwg_bootstrap_build--master-arm-bootstrap_profiled_lto-build SUCCESS (none) 02days 09hrs ago : #10206-gcc-R# FAILED artifacts/results/ email/jira/ log/status 02days 09hrs ago : #10206-gcc-R# FAILED 06days 11hrs ago : #10199-skip-scm-build 05days 21hrs ago : #10201-gcc-R# 00:55:52 make: *** [Makefile:27333: profiledbootstrap] Error 2-force (bisect : gcc-53bcce7) 6.0 regressed(05%) force(11%) fail(22%) ok(55%) skip(05%) nbruns=18
tcwg_bootstrap_build--master-arm-bootstrap_profiled_lto_lean-build SUCCESS (none) 02days 03hrs ago : #10202-gcc-R# FAILED artifacts/results/ email/jira/ log/status 02days 03hrs ago : #10202-gcc-R# FAILED 06days 01hrs ago : #10195-skip-scm-build 05days 13hrs ago : #10197-gcc-R# 00:31:16 make: *** [Makefile:27333: profiledbootstrap] Error 2-force (bisect : gcc-53bcce7) 6.0 regressed(05%) force(11%) fail(23%) ok(52%) skip(05%) nbruns=17
tcwg_bootstrap_build--master-arm-bootstrap_ubsan-build SUCCESS (none) 02days 16hrs ago : #10201-gcc-R1 artifacts/results/ email/jira/ log/status 02days 16hrs ago : #10201-gcc-R1 09days 16hrs ago : #10194 never 6.0 regressed(00%) force(00%) fail(33%) ok(66%) skip(00%) nbruns=15
tcwg_bootstrap_check--master-aarch64-check_bootstrap-build BISECTING (check_regression) 01days 23hrs ago : #10316-gcc-R# 18 regressions-trigger-bisect artifacts/results/ email/jira/ log/status 02days 05hrs ago : #10315-gcc-R# 3 regressions-force 01days 23hrs ago : #10316-gcc-R# 18 regressions-trigger-bisect 02days 05hrs ago : #10315-gcc-R# 3 regressions-force (bisect : gcc-ff0b2fe) 6.0 regressed(30%) force(30%) fail(17%) ok(21%) skip(00%) nbruns=23
tcwg_bootstrap_check--master-aarch64-check_bootstrap_lto-build BISECTING (check_regression) 02days 00hrs ago : #10316-gcc-R# 18 regressions-trigger-bisect artifacts/results/ email/jira/ log/status 02days 07hrs ago : #10315-gcc-R# 3 regressions-force 02days 00hrs ago : #10316-gcc-R# 18 regressions-trigger-bisect 02days 07hrs ago : #10315-gcc-R# 3 regressions-force (bisect : gcc-ff0b2fe) 6.0 regressed(31%) force(27%) fail(22%) ok(00%) skip(13%) nbruns=22
tcwg_bootstrap_check--master-arm-check_bootstrap-build FAILURE (round-robin-baseline.sh) 02days 14hrs ago : #10199-gcc artifacts/results/ email/jira/ log/status never 02days 14hrs ago : #10199-gcc never -- regressed(00%) force(00%) fail(100%) ok(00%) skip(00%) nbruns=15
tcwg_bootstrap_check--master-arm-check_bootstrap_lto-build FAILURE (round-robin-baseline.sh) 02days 14hrs ago : #10200-gcc artifacts/results/ email/jira/ log/status 176days 14hrs ago : #10027-R# 24 regressions-force 02days 14hrs ago : #10200-gcc 176days 14hrs ago : #10027-R# 24 regressions-force (bisect : gcc-21d1bb1) 6.0 (not-completed) regressed(00%) force(06%) fail(93%) ok(00%) skip(00%) nbruns=16
tcwg_flang_build--main-aarch64-build SUCCESS (none) 00days 01hrs ago : #12180-llvm-R1 artifacts/results/ email/jira/ log/status 00days 01hrs ago : #12180-llvm-R1 never never 3.0 regressed(00%) force(00%) fail(00%) ok(100%) skip(00%) nbruns=100
tcwg_flang_test--main-aarch64-O0-debug-build SUCCESS (none) 00days 03hrs ago : #10947-fujitsu_testsuite-llvm-llvm_testsuite-R1 artifacts/results/ email/jira/ log/status 00days 03hrs ago : #10947-fujitsu_testsuite-llvm-llvm_testsuite-R1 01days 02hrs ago : #10941-skip-scm-build 00days 19hrs ago : #10943-llvm-R# 5 regressions-force (bisect : llvm-63f0660) 3.0 regressed(05%) force(10%) fail(29%) ok(45%) skip(08%) nbruns=84
tcwg_flang_test--main-aarch64-O3-neoverse_v1-sve_vla-mpipeliner-stack_arrays-build SUCCESS (none) 00days 05hrs ago : #10849-fujitsu_testsuite-llvm-llvm_testsuite-R1 artifacts/results/ email/jira/ log/status 00days 05hrs ago : #10849-fujitsu_testsuite-llvm-llvm_testsuite-R1 02days 02hrs ago : #10837-skip-scm-build 01days 22hrs ago : #10839-llvm-R# 5 regressions-force (bisect : llvm-63f0660) 3.0 regressed(05%) force(10%) fail(25%) ok(50%) skip(06%) nbruns=90
tcwg_flang_test--main-aarch64-Ofast-sve_vla-build SUCCESS (none) 00days 04hrs ago : #10813-fujitsu_testsuite-llvm-llvm_testsuite-R1 artifacts/results/ email/jira/ log/status 00days 04hrs ago : #10813-fujitsu_testsuite-llvm-llvm_testsuite-R1 01days 14hrs ago : #10805-skip-scm-build 01days 08hrs ago : #10807-llvm-R# 4 regressions-force (bisect : llvm-63f0660) 3.0 regressed(07%) force(14%) fail(30%) ok(34%) skip(12%) nbruns=81
tcwg_flang_test--main-aarch64-Ofast-sve_vls-lto-lld-build UNSTABLE 00days 04hrs ago : #10824-skip-scm-build artifacts/results/ email/jira/ log/status 00days 08hrs ago : #10823-llvm_testsuite-R1 00days 04hrs ago : #10824-skip-scm-build 02days 12hrs ago : #10818-llvm-R# 2 regressions-force (bisect : llvm-64bcef5) 3.0 regressed(16%) force(21%) fail(42%) ok(05%) skip(14%) nbruns=75
tcwg_flang_vect--main-aarch64-Ofast-sve_vla-build SUCCESS (none) 00days 03hrs ago : #962-llvm-llvm_testsuite-R1 artifacts/results/ email/jira/ log/status 00days 03hrs ago : #962-llvm-llvm_testsuite-R1 03days 09hrs ago : #944-llvm-llvm_testsuite-R# test_llvm: 13days 18hrs ago : #887-llvm-R# 2 regressions-force (bisect : llvm-3f11639) 3.0 regressed(01%) force(02%) fail(11%) ok(84%) skip(01%) nbruns=100
tcwg_gcc_build--master-aarch64-build SUCCESS (none) 01days 22hrs ago : #10688-gcc-R1 artifacts/results/ email/jira/ log/status 01days 22hrs ago : #10688-gcc-R1 09days 16hrs ago : #10666 never 6.0 regressed(00%) force(00%) fail(30%) ok(67%) skip(02%) nbruns=46
tcwg_gcc_build--master-arm-build SUCCESS (none) 01days 18hrs ago : #10718-gcc-R1 artifacts/results/ email/jira/ log/status 01days 18hrs ago : #10718-gcc-R1 09days 16hrs ago : #10693 never 6.0 regressed(00%) force(00%) fail(28%) ok(71%) skip(00%) nbruns=49
tcwg_gcc_check--master-aarch64-build FORCED (none) 01days 21hrs ago : #10741-R0-force artifacts/results/ email/jira/ log/status 01days 21hrs ago : #10741-R0-force 02days 00hrs ago : #10740-skip-scm-build 01days 21hrs ago : #10741-R0-force (bisect : gcc-a484431) 6.0 regressed(15%) force(19%) fail(30%) ok(23%) skip(10%) nbruns=46
tcwg_gcc_check--master-arm-build BISECTING (check_regression) 02days 00hrs ago : #10793-gcc-R# 38 regressions-trigger-bisect artifacts/results/ email/jira/ log/status 02days 05hrs ago : #10792-gcc-R# 3 regressions-force 02days 00hrs ago : #10793-gcc-R# 38 regressions-trigger-bisect 02days 05hrs ago : #10792-gcc-R# 3 regressions-force (bisect : gcc-ff0b2fe) 6.0 regressed(18%) force(32%) fail(28%) ok(10%) skip(12%) nbruns=50
tcwg_gdb_build--master-aarch64-build SUCCESS (none) 01days 20hrs ago : #10642-gdb-R1 artifacts/results/ email/jira/ log/status 01days 20hrs ago : #10642-gdb-R1 09days 16hrs ago : #10620 never 6.0 regressed(00%) force(00%) fail(33%) ok(66%) skip(00%) nbruns=45
tcwg_gdb_build--master-arm-build SUCCESS (none) 01days 19hrs ago : #10674-gdb-R1 artifacts/results/ email/jira/ log/status 01days 19hrs ago : #10674-gdb-R1 09days 16hrs ago : #10650 never 6.0 regressed(00%) force(00%) fail(31%) ok(68%) skip(00%) nbruns=48
tcwg_gdb_check--master-aarch64-build SUCCESS (none) 02days 02hrs ago : #10666-gdb-R0 artifacts/results/ email/jira/ log/status 02days 02hrs ago : #10666-gdb-R0 09days 16hrs ago : #10644 never 6.0 regressed(00%) force(00%) fail(30%) ok(67%) skip(00%) nbruns=46
tcwg_gdb_check--master-arm-build SUCCESS (none) 01days 20hrs ago : #10648-gdb-R0 artifacts/results/ email/jira/ log/status 01days 20hrs ago : #10648-gdb-R0 09days 16hrs ago : #10627 never 6.0 regressed(00%) force(00%) fail(34%) ok(65%) skip(00%) nbruns=44
tcwg_glibc_build--master-aarch64-build SUCCESS (none) 01days 21hrs ago : #10658-glibc-R1 artifacts/results/ email/jira/ log/status 01days 21hrs ago : #10658-glibc-R1 16days 19hrs ago : #10626 never 6.0 regressed(00%) force(00%) fail(28%) ok(71%) skip(00%) nbruns=45
tcwg_glibc_build--master-arm-build SUCCESS (none) 01days 18hrs ago : #10680-glibc-R1 artifacts/results/ email/jira/ log/status 01days 18hrs ago : #10680-glibc-R1 09days 16hrs ago : #10655 never 6.0 regressed(00%) force(00%) fail(28%) ok(71%) skip(00%) nbruns=49
tcwg_glibc_check--master-aarch64-build SUCCESS (none) 01days 21hrs ago : #10684-glibc-R0 artifacts/results/ email/jira/ log/status 01days 21hrs ago : #10684-glibc-R0 09days 10hrs ago : #10662-glibc-R# 98 regressions-trigger-bisect 09days 02hrs ago : #10663-R# 98 regressions-force (bisect : glibc-spurious) 6.0 regressed(02%) force(02%) fail(31%) ok(63%) skip(00%) nbruns=47
tcwg_glibc_check--master-arm-build SUCCESS (none) 01days 22hrs ago : #10663-glibc-R0 artifacts/results/ email/jira/ log/status 01days 22hrs ago : #10663-glibc-R0 09days 12hrs ago : #10641-glibc-R# 115 regressions-trigger-bisect 09days 06hrs ago : #10642-R# 115 regressions-force (bisect : glibc-spurious) 6.0 regressed(02%) force(02%) fail(29%) ok(65%) skip(00%) nbruns=47
tcwg_gnu_cross_build--master-aarch64-build SUCCESS (none) 00days 06hrs ago : #10239-binutils-gcc-gdb-glibc-linux-qemu-R7 artifacts/results/ email/jira/ log/status 00days 06hrs ago : #10239-binutils-gcc-gdb-glibc-linux-qemu-R7 04days 08hrs ago : #10235 never 6.0 regressed(00%) force(00%) fail(25%) ok(75%) skip(00%) nbruns=20
tcwg_gnu_cross_build--master-arm-build SUCCESS (none) 00days 19hrs ago : #10230-binutils-gcc-gdb-glibc-linux-qemu-R7 artifacts/results/ email/jira/ log/status 00days 19hrs ago : #10230-binutils-gcc-gdb-glibc-linux-qemu-R7 04days 00hrs ago : #10227 never 6.0 regressed(00%) force(00%) fail(25%) ok(75%) skip(00%) nbruns=20
tcwg_gnu_cross_check_binutils--master-aarch64-build SUCCESS (none) 00days 14hrs ago : #10214-binutils-gcc-gdb-glibc-linux-qemu-R0 artifacts/results/ email/jira/ log/status 00days 14hrs ago : #10214-binutils-gcc-gdb-glibc-linux-qemu-R0 03days 16hrs ago : #10211 never 6.0 regressed(00%) force(00%) fail(30%) ok(70%) skip(00%) nbruns=20
tcwg_gnu_cross_check_binutils--master-arm-build SUCCESS (none) 01days 02hrs ago : #10218-binutils-gcc-gdb-glibc-linux-qemu-R0 artifacts/results/ email/jira/ log/status 01days 02hrs ago : #10218-binutils-gcc-gdb-glibc-linux-qemu-R0 04days 04hrs ago : #10215 never 6.0 regressed(00%) force(00%) fail(25%) ok(70%) skip(00%) nbruns=20
tcwg_gnu_cross_check_gcc--master-aarch64-build BISECTING (check_regression) 00days 06hrs ago : #10510-gcc-R# 14 regressions-trigger-bisect artifacts/results/ email/jira/ log/status 00days 14hrs ago : #10509-binutils-gdb-glibc-qemu-R0 00days 06hrs ago : #10510-gcc-R# 14 regressions-trigger-bisect 01days 07hrs ago : #10506-gcc-R# 3 regressions-force (bisect : gcc-4eda76c) 6.0 regressed(14%) force(22%) fail(25%) ok(17%) skip(20%) nbruns=63
tcwg_gnu_cross_check_gcc--master-arm-build UNSTABLE 00days 01hrs ago : #10538-skip-scm-build artifacts/results/ email/jira/ log/status 00days 17hrs ago : #10536-gcc-R# 57 regressions-force 00days 01hrs ago : #10538-skip-scm-build 00days 17hrs ago : #10536-gcc-R# 57 regressions-force (bisect : gcc-53bcce7) 6.0 regressed(15%) force(27%) fail(25%) ok(15%) skip(15%) nbruns=76
tcwg_gnu_embed_build--master-arm_eabi-build SUCCESS (none) 02days 10hrs ago : #10059-binutils-gcc-gdb-newlib-qemu-R7 artifacts/results/ email/jira/ log/status 02days 10hrs ago : #10059-binutils-gcc-gdb-newlib-qemu-R7 17days 12hrs ago : #10054 never 6.0 regressed(00%) force(00%) fail(16%) ok(83%) skip(00%) nbruns=6
tcwg_gnu_embed_build--master-arm_v7a_softfp_eabi-build SUCCESS (none) 02days 16hrs ago : #10059-binutils-gcc-gdb-newlib-qemu-R7 artifacts/results/ email/jira/ log/status 02days 16hrs ago : #10059-binutils-gcc-gdb-newlib-qemu-R7 17days 16hrs ago : #10054 never 6.0 regressed(00%) force(00%) fail(16%) ok(83%) skip(00%) nbruns=6
tcwg_gnu_embed_build--master-thumb_m0_soft_eabi-build SUCCESS (none) 03days 02hrs ago : #10066-binutils-gcc-gdb-newlib-qemu-R7 artifacts/results/ email/jira/ log/status 03days 02hrs ago : #10066-binutils-gcc-gdb-newlib-qemu-R7 18days 02hrs ago : #10061 never 6.0 regressed(00%) force(00%) fail(14%) ok(71%) skip(00%) nbruns=7
tcwg_gnu_embed_build--master-thumb_m23_soft_eabi-build SUCCESS (none) 01days 03hrs ago : #10064-binutils-gcc-gdb-newlib-qemu-R7 artifacts/results/ email/jira/ log/status 01days 03hrs ago : #10064-binutils-gcc-gdb-newlib-qemu-R7 19days 05hrs ago : #10058 never 6.0 regressed(00%) force(00%) fail(14%) ok(85%) skip(00%) nbruns=7
tcwg_gnu_embed_build--master-thumb_m33_hard_eabi-build SUCCESS (none) 00days 08hrs ago : #10072-binutils-gcc-gdb-newlib-qemu-R7 artifacts/results/ email/jira/ log/status 00days 08hrs ago : #10072-binutils-gcc-gdb-newlib-qemu-R7 18days 12hrs ago : #10066 never 6.0 regressed(00%) force(00%) fail(14%) ok(85%) skip(00%) nbruns=7
tcwg_gnu_embed_build--master-thumb_m3_softfp_eabi-build SUCCESS (none) 03days 00hrs ago : #10066-binutils-gcc-gdb-newlib-qemu-R7 artifacts/results/ email/jira/ log/status 03days 00hrs ago : #10066-binutils-gcc-gdb-newlib-qemu-R7 18days 00hrs ago : #10061 never 6.0 regressed(00%) force(00%) fail(16%) ok(83%) skip(00%) nbruns=6
tcwg_gnu_embed_build--master-thumb_m55_hard_eabi-build SUCCESS (none) 01days 20hrs ago : #10059-binutils-gcc-gdb-newlib-qemu-R7 artifacts/results/ email/jira/ log/status 01days 20hrs ago : #10059-binutils-gcc-gdb-newlib-qemu-R7 16days 21hrs ago : #10054 never 6.0 regressed(00%) force(00%) fail(28%) ok(71%) skip(00%) nbruns=7
tcwg_gnu_embed_build--master-thumb_m7_hard_eabi-build SUCCESS (none) 01days 21hrs ago : #10059-binutils-gcc-gdb-newlib-qemu-R7 artifacts/results/ email/jira/ log/status 01days 21hrs ago : #10059-binutils-gcc-gdb-newlib-qemu-R7 16days 22hrs ago : #10054 never 6.0 regressed(00%) force(00%) fail(28%) ok(71%) skip(00%) nbruns=7
tcwg_gnu_embed_build--master-thumb_v8a_hard_eabi-build SUCCESS (none) 03days 02hrs ago : #10066-binutils-gcc-gdb-newlib-qemu-R7 artifacts/results/ email/jira/ log/status 03days 02hrs ago : #10066-binutils-gcc-gdb-newlib-qemu-R7 15days 02hrs ago : #10062 never 6.0 regressed(00%) force(00%) fail(33%) ok(66%) skip(00%) nbruns=6
tcwg_gnu_embed_check_binutils--master-arm_eabi-build SUCCESS (none) 01days 17hrs ago : #10059-binutils-gcc-gdb-newlib-qemu-R0 artifacts/results/ email/jira/ log/status 01days 17hrs ago : #10059-binutils-gcc-gdb-newlib-qemu-R0 04days 18hrs ago : #10058 never 6.0 regressed(00%) force(00%) fail(42%) ok(57%) skip(00%) nbruns=7
tcwg_gnu_embed_check_binutils--master-arm_v7a_softfp_eabi-build SUCCESS (none) 00days 20hrs ago : #10061-binutils-gcc-gdb-newlib-qemu-R0 artifacts/results/ email/jira/ log/status 00days 20hrs ago : #10061-binutils-gcc-gdb-newlib-qemu-R0 04days 00hrs ago : #10060 never 6.0 regressed(00%) force(00%) fail(28%) ok(71%) skip(00%) nbruns=7
tcwg_gnu_embed_check_binutils--master-thumb_m0_soft_eabi-build SUCCESS (none) 00days 17hrs ago : #10068-binutils-gcc-gdb-newlib-qemu-R0 artifacts/results/ email/jira/ log/status 00days 17hrs ago : #10068-binutils-gcc-gdb-newlib-qemu-R0 18days 18hrs ago : #10062 never 6.0 regressed(00%) force(00%) fail(14%) ok(85%) skip(00%) nbruns=7
tcwg_gnu_embed_check_binutils--master-thumb_m23_soft_eabi-build SUCCESS (none) 01days 07hrs ago : #10060-binutils-gcc-gdb-newlib-qemu-R0 artifacts/results/ email/jira/ log/status 01days 07hrs ago : #10060-binutils-gcc-gdb-newlib-qemu-R0 19days 08hrs ago : #10054 never 6.0 regressed(00%) force(00%) fail(14%) ok(85%) skip(00%) nbruns=7
tcwg_gnu_embed_check_binutils--master-thumb_m33_hard_eabi-build SUCCESS (none) 00days 01hrs ago : #10067-binutils-gcc-gdb-newlib-qemu-R0 artifacts/results/ email/jira/ log/status 00days 01hrs ago : #10067-binutils-gcc-gdb-newlib-qemu-R0 18days 06hrs ago : #10061 never 6.0 regressed(00%) force(00%) fail(14%) ok(85%) skip(00%) nbruns=7
tcwg_gnu_embed_check_binutils--master-thumb_m3_softfp_eabi-build SUCCESS (none) 00days 20hrs ago : #10061-binutils-gcc-gdb-newlib-qemu-R0 artifacts/results/ email/jira/ log/status 00days 20hrs ago : #10061-binutils-gcc-gdb-newlib-qemu-R0 04days 00hrs ago : #10060 never 6.0 regressed(00%) force(00%) fail(28%) ok(71%) skip(00%) nbruns=7
tcwg_gnu_embed_check_binutils--master-thumb_m55_hard_eabi-build SUCCESS (none) 00days 16hrs ago : #10068-binutils-gcc-gdb-newlib-qemu-R0 artifacts/results/ email/jira/ log/status 00days 16hrs ago : #10068-binutils-gcc-gdb-newlib-qemu-R0 03days 18hrs ago : #10067 never 6.0 regressed(00%) force(00%) fail(28%) ok(71%) skip(00%) nbruns=7
tcwg_gnu_embed_check_binutils--master-thumb_m7_hard_eabi-build SUCCESS (none) 00days 18hrs ago : #10068-binutils-gcc-gdb-newlib-qemu-R0 artifacts/results/ email/jira/ log/status 00days 18hrs ago : #10068-binutils-gcc-gdb-newlib-qemu-R0 18days 22hrs ago : #10062 never 6.0 regressed(00%) force(00%) fail(14%) ok(85%) skip(00%) nbruns=7
tcwg_gnu_embed_check_binutils--master-thumb_v8a_hard_eabi-build SUCCESS (none) 00days 16hrs ago : #10068-binutils-gcc-gdb-newlib-qemu-R0 artifacts/results/ email/jira/ log/status 00days 16hrs ago : #10068-binutils-gcc-gdb-newlib-qemu-R0 03days 17hrs ago : #10067 never 6.0 regressed(00%) force(00%) fail(28%) ok(71%) skip(00%) nbruns=7
tcwg_gnu_embed_check_gcc--master-arm_eabi-build FORCED (none) 00days 06hrs ago : #10271-gcc-R# 1 regressions-force artifacts/results/ email/jira/ log/status 00days 06hrs ago : #10271-gcc-R# 1 regressions-force 01days 22hrs ago : #10269-gcc-R# 21 regressions-trigger-bisect 00days 06hrs ago : #10271-gcc-R# 1 regressions-force (bisect : gcc-3d0eda7) 6.0 regressed(15%) force(28%) fail(28%) ok(25%) skip(03%) nbruns=32
tcwg_gnu_embed_check_gcc--master-arm_v7a_softfp_eabi-build SUCCESS (none) 01days 05hrs ago : #10297-binutils-gcc-gdb-newlib-qemu-R0 artifacts/results/ email/jira/ log/status 01days 05hrs ago : #10297-binutils-gcc-gdb-newlib-qemu-R0 02days 08hrs ago : #10294-gcc-R# 17 regressions-trigger-bisect 01days 08hrs ago : #10296-gcc-R# 1 regressions-force (bisect : gcc-3d0eda7) 6.0 regressed(18%) force(30%) fail(24%) ok(24%) skip(03%) nbruns=33
tcwg_gnu_embed_check_gcc--master-thumb_m0_soft_eabi-build BISECTING (check_regression) 00days 15hrs ago : #10283-gcc-R# 4 regressions-trigger-bisect artifacts/results/ email/jira/ log/status 00days 18hrs ago : #10282-binutils-gdb-newlib-R0 00days 15hrs ago : #10283-gcc-R# 4 regressions-trigger-bisect 01days 05hrs ago : #10280-gcc-R# 16 regressions-force (bisect : gcc-a484431) 6.0 regressed(20%) force(32%) fail(22%) ok(24%) skip(02%) nbruns=50
tcwg_gnu_embed_check_gcc--master-thumb_m23_soft_eabi-build BISECTING (check_regression) 00days 16hrs ago : #10258-gcc-R# 5 regressions-trigger-bisect artifacts/results/ email/jira/ log/status 00days 19hrs ago : #10257-binutils-gdb-newlib-qemu-R0 00days 16hrs ago : #10258-gcc-R# 5 regressions-trigger-bisect 05days 13hrs ago : #10249-gcc-R# 2 regressions-force (bisect : gcc-08c2656) 6.0 regressed(17%) force(25%) fail(28%) ok(23%) skip(00%) nbruns=39
tcwg_gnu_embed_check_gcc--master-thumb_m33_hard_eabi-build FAILURE (check_regression) 00days 06hrs ago : #10273-binutils-gcc-gdb-newlib-qemu-R# 4 regressions artifacts/results/ email/jira/ log/status 02days 14hrs ago : #10272-gcc-R0 00days 06hrs ago : #10273-binutils-gcc-gdb-newlib-qemu-R# 4 regressions 02days 20hrs ago : #10269-gcc-R# 1 regressions-force (bisect : gcc-3d0eda7) 6.0 regressed(17%) force(28%) fail(26%) ok(23%) skip(02%) nbruns=46
tcwg_gnu_embed_check_gcc--master-thumb_m3_softfp_eabi-build FORCED (none) 00days 11hrs ago : #10314-R0-force artifacts/results/ email/jira/ log/status 00days 11hrs ago : #10314-R0-force 01days 19hrs ago : #10313-gcc-R# 16 regressions-trigger-bisect 00days 11hrs ago : #10314-R0-force (bisect : gcc-spurious) 6.0 regressed(17%) force(32%) fail(28%) ok(21%) skip(00%) nbruns=46
tcwg_gnu_embed_check_gcc--master-thumb_m55_hard_eabi-build SUCCESS (none) 01days 15hrs ago : #10233-binutils-gcc-gdb-newlib-qemu-R0 artifacts/results/ email/jira/ log/status 01days 15hrs ago : #10233-binutils-gcc-gdb-newlib-qemu-R0 02days 09hrs ago : #10230-gcc-R# 17 regressions-trigger-bisect 01days 19hrs ago : #10232-gcc-R# 1 regressions-force (bisect : gcc-3d0eda7) 6.0 regressed(17%) force(29%) fail(26%) ok(24%) skip(02%) nbruns=41
tcwg_gnu_embed_check_gcc--master-thumb_m7_hard_eabi-build SUCCESS (none) 00days 07hrs ago : #10284-binutils-gcc-gdb-newlib-qemu-R0 artifacts/results/ email/jira/ log/status 00days 07hrs ago : #10284-binutils-gcc-gdb-newlib-qemu-R0 01days 10hrs ago : #10283 01days 13hrs ago : #10282-gcc-R# 16 regressions-force (bisect : gcc-a484431) 6.0 regressed(17%) force(30%) fail(23%) ok(25%) skip(02%) nbruns=39
tcwg_gnu_embed_check_gcc--master-thumb_v8a_hard_eabi-build BISECTING (check_regression) 00days 08hrs ago : #10295-gcc-R# 4 regressions-trigger-bisect artifacts/results/ email/jira/ log/status 00days 13hrs ago : #10294-binutils-gdb-newlib-qemu-R0 00days 08hrs ago : #10295-gcc-R# 4 regressions-trigger-bisect 04days 03hrs ago : #10288-gcc-R# 1 regressions-force (bisect : gcc-3d0eda7) 6.0 regressed(22%) force(27%) fail(25%) ok(22%) skip(02%) nbruns=36
tcwg_gnu_mingw_build--master-woa64-build never never - never never never -- --
tcwg_gnu_mingw_check_binutils--master-woa64-build never never - never never never -- --
tcwg_gnu_mingw_check_gcc--master-woa64-build never never - never never never -- --
tcwg_gnu_native_build--master-aarch64-build SUCCESS (none) 01days 18hrs ago : #10232-binutils-gcc-gdb-glibc-linux-R6 artifacts/results/ email/jira/ log/status 01days 18hrs ago : #10232-binutils-gcc-gdb-glibc-linux-R6 09days 17hrs ago : #10224 never 6.0 regressed(00%) force(00%) fail(31%) ok(68%) skip(00%) nbruns=19
tcwg_gnu_native_build--master-arm-build SUCCESS (none) 02days 02hrs ago : #10218-binutils-gcc-gdb-glibc-linux-R6 artifacts/results/ email/jira/ log/status 02days 02hrs ago : #10218-binutils-gcc-gdb-glibc-linux-R6 07days 21hrs ago : #10210-R# 00:30:11 make[2]: [Makefile:4322: install-common] Error 1 (ignored)-force 07days 12hrs ago : #10211-gcc-R# 00:42:58 make: *** [Makefile:1101: all] Error 2-force (bisect : gcc-0cb6acb) 6.0 regressed(09%) force(09%) fail(28%) ok(52%) skip(00%) nbruns=21
tcwg_gnu_native_check_binutils--master-aarch64-build SUCCESS (none) 02days 10hrs ago : #10205-binutils-gcc-gdb-glibc-linux-R0 artifacts/results/ email/jira/ log/status 02days 10hrs ago : #10205-binutils-gcc-gdb-glibc-linux-R0 09days 16hrs ago : #10197 never 6.0 regressed(00%) force(00%) fail(31%) ok(62%) skip(00%) nbruns=16
tcwg_gnu_native_check_binutils--master-arm-build SUCCESS (none) 02days 16hrs ago : #10198-binutils-gcc-gdb-glibc-linux-R0 artifacts/results/ email/jira/ log/status 02days 16hrs ago : #10198-binutils-gcc-gdb-glibc-linux-R0 05days 14hrs ago : #10195-binutils-gcc-gdb-glibc-linux-R# build_abe check_binutils --: never 6.0 regressed(00%) force(00%) fail(33%) ok(26%) skip(00%) nbruns=15
tcwg_gnu_native_check_gcc--master-aarch64-build FORCED (none) 01days 21hrs ago : #10418-R0-force artifacts/results/ email/jira/ log/status 01days 21hrs ago : #10418-R0-force 02days 02hrs ago : #10417-skip-scm-build 01days 21hrs ago : #10418-R0-force (bisect : gcc-3d0eda7) 6.0 regressed(16%) force(16%) fail(30%) ok(16%) skip(13%) nbruns=36
tcwg_gnu_native_check_gcc--master-arm-build UNSTABLE (check_gcc --) 02days 02hrs ago : #10201-binutils-gcc-gdb-glibc-linux-R# FAILED artifacts/results/ email/jira/ log/status never 02days 02hrs ago : #10201-binutils-gcc-gdb-glibc-linux-R# FAILED never -- regressed(00%) force(00%) fail(26%) ok(00%) skip(00%) nbruns=15
tcwg_gnu_native_check_gdb--master-aarch64-build SUCCESS (none) 02days 07hrs ago : #10221-binutils-gcc-gdb-glibc-linux-R0 artifacts/results/ email/jira/ log/status 02days 07hrs ago : #10221-binutils-gcc-gdb-glibc-linux-R0 09days 16hrs ago : #10213 never 6.0 regressed(00%) force(00%) fail(25%) ok(68%) skip(00%) nbruns=16
tcwg_gnu_native_check_gdb--master-arm-build SUCCESS (none) 02days 15hrs ago : #10222-binutils-gcc-gdb-glibc-linux-R0 artifacts/results/ email/jira/ log/status 02days 15hrs ago : #10222-binutils-gcc-gdb-glibc-linux-R0 05days 14hrs ago : #10219-binutils-gcc-gdb-glibc-linux-R# build_abe check_gdb -- --set check_buffer_workaround=gdb-read1: never 6.0 regressed(00%) force(00%) fail(33%) ok(26%) skip(00%) nbruns=15
tcwg_gnu_native_check_glibc--master-aarch64-build SUCCESS (none) 01days 23hrs ago : #10265-binutils-gcc-gdb-glibc-linux-R0 artifacts/results/ email/jira/ log/status 01days 23hrs ago : #10265-binutils-gcc-gdb-glibc-linux-R0 05days 19hrs ago : #10260-linux-R# 116 regressions-trigger-bisect 05days 05hrs ago : #10261-R# 116 regressions-force (bisect : linux-spurious) 6.0 regressed(26%) force(05%) fail(31%) ok(36%) skip(00%) nbruns=19
tcwg_gnu_native_check_glibc--master-arm-build BISECTING (check_regression) 01days 19hrs ago : #10265-linux-R# 118 regressions-trigger-bisect artifacts/results/ email/jira/ log/status 14days 20hrs ago : #10252-binutils-gcc-gdb-glibc-linux-R0 01days 19hrs ago : #10265-linux-R# 118 regressions-trigger-bisect never 6.0 regressed(27%) force(00%) fail(33%) ok(11%) skip(00%) nbruns=18
tcwg_gnu_native_fast_check_gcc--master-aarch64-build UNSTABLE (gcc) 02days 06hrs ago : #10205-binutils-gcc-gdb-glibc-linux-R# build_abe check_gcc -- --set runtestflags=compile.exp --set runtestflags=execute.exp: artifacts/results/ email/jira/ log/status 06days 23hrs ago : #10199-R0-force 02days 06hrs ago : #10205-binutils-gcc-gdb-glibc-linux-R# build_abe check_gcc -- --set runtestflags=compile.exp --set runtestflags=execute.exp: 06days 23hrs ago : #10199-R0-force (bisect : gcc-advance-baseline) 6.0 regressed(13%) force(04%) fail(31%) ok(13%) skip(09%) nbruns=22
tcwg_gnu_native_fast_check_gcc--master-arm-build UNSTABLE (gdb) 02days 08hrs ago : #10219-binutils-gcc-gdb-glibc-linux-R# build_abe check_gcc -- --set runtestflags=compile.exp --set runtestflags=execute.exp: artifacts/results/ email/jira/ log/status 14days 01hrs ago : #10208-binutils-gdb-glibc-R0 02days 08hrs ago : #10219-binutils-gcc-gdb-glibc-linux-R# build_abe check_gcc -- --set runtestflags=compile.exp --set runtestflags=execute.exp: 15days 01hrs ago : #10205-gcc-R# 1 regressions-force (bisect : gcc-5f9f871) 6.0 regressed(04%) force(09%) fail(27%) ok(09%) skip(04%) nbruns=22
tcwg_gnu_native_fast_check_gdb--master-aarch64-build UNSTABLE (gcc) 01days 21hrs ago : #10199-binutils-gcc-gdb-glibc-linux-R# build_abe check_gdb -- --set runtestflags=gdb.base/break-always.exp --set runtestflags=gdb.base/break-caller-line.exp --set runtestflags=gdb.base/break-entry.exp --set runtestflags=gdb.base/break.exp --set runtestflags=gdb.base/break-fun-addr.exp --set runtestflags=gdb.base/break-idempotent.exp --set runtestflags=gdb.base/break-include.exp --set runtestflags=gdb.base/break-inline.exp --set runtestflags=gdb.base/break-main-file-remove-fail.exp --set runtestflags=gdb.base/break-on-linker-gcd-function.exp --set runtestflags=gdb.base/breakpoint-in-ro-region.exp --set runtestflags=gdb.base/breakpoint-shadow.exp --set runtestflags=gdb.base/break-probes.exp --set runtestflags=gdb.gdb/unittest.exp --set check_buffer_workaround=gdb-read1: artifacts/results/ email/jira/ log/status 08days 21hrs ago : #10192-binutils-gcc-gdb-glibc-linux-R0 01days 21hrs ago : #10199-binutils-gcc-gdb-glibc-linux-R# build_abe check_gdb -- --set runtestflags=gdb.base/break-always.exp --set runtestflags=gdb.base/break-caller-line.exp --set runtestflags=gdb.base/break-entry.exp --set runtestflags=gdb.base/break.exp --set runtestflags=gdb.base/break-fun-addr.exp --set runtestflags=gdb.base/break-idempotent.exp --set runtestflags=gdb.base/break-include.exp --set runtestflags=gdb.base/break-inline.exp --set runtestflags=gdb.base/break-main-file-remove-fail.exp --set runtestflags=gdb.base/break-on-linker-gcd-function.exp --set runtestflags=gdb.base/breakpoint-in-ro-region.exp --set runtestflags=gdb.base/breakpoint-shadow.exp --set runtestflags=gdb.base/break-probes.exp --set runtestflags=gdb.gdb/unittest.exp --set check_buffer_workaround=gdb-read1: never 6.0 regressed(00%) force(00%) fail(26%) ok(26%) skip(00%) nbruns=15
tcwg_gnu_native_fast_check_gdb--master-arm-build UNSTABLE (gcc) 02days 01hrs ago : #10199-binutils-gcc-gdb-glibc-linux-R# build_abe check_gdb -- --set runtestflags=gdb.base/break-always.exp --set runtestflags=gdb.base/break-caller-line.exp --set runtestflags=gdb.base/break-entry.exp --set runtestflags=gdb.base/break.exp --set runtestflags=gdb.base/break-fun-addr.exp --set runtestflags=gdb.base/break-idempotent.exp --set runtestflags=gdb.base/break-include.exp --set runtestflags=gdb.base/break-inline.exp --set runtestflags=gdb.base/break-main-file-remove-fail.exp --set runtestflags=gdb.base/break-on-linker-gcd-function.exp --set runtestflags=gdb.base/breakpoint-in-ro-region.exp --set runtestflags=gdb.base/breakpoint-shadow.exp --set runtestflags=gdb.base/break-probes.exp --set runtestflags=gdb.gdb/unittest.exp --set check_buffer_workaround=gdb-read1: artifacts/results/ email/jira/ log/status 14days 21hrs ago : #10189-binutils-gcc-gdb-glibc-linux-R0 02days 01hrs ago : #10199-binutils-gcc-gdb-glibc-linux-R# build_abe check_gdb -- --set runtestflags=gdb.base/break-always.exp --set runtestflags=gdb.base/break-caller-line.exp --set runtestflags=gdb.base/break-entry.exp --set runtestflags=gdb.base/break.exp --set runtestflags=gdb.base/break-fun-addr.exp --set runtestflags=gdb.base/break-idempotent.exp --set runtestflags=gdb.base/break-include.exp --set runtestflags=gdb.base/break-inline.exp --set runtestflags=gdb.base/break-main-file-remove-fail.exp --set runtestflags=gdb.base/break-on-linker-gcd-function.exp --set runtestflags=gdb.base/breakpoint-in-ro-region.exp --set runtestflags=gdb.base/breakpoint-shadow.exp --set runtestflags=gdb.base/break-probes.exp --set runtestflags=gdb.gdb/unittest.exp --set check_buffer_workaround=gdb-read1: never 6.0 regressed(00%) force(00%) fail(26%) ok(13%) skip(00%) nbruns=15
tcwg_simplebootstrap_build--master-aarch64-bootstrap-build SUCCESS (none) 01days 23hrs ago : #10542-gcc-R1 artifacts/results/ email/jira/ log/status 01days 23hrs ago : #10542-gcc-R1 09days 16hrs ago : #10520 never 6.0 regressed(00%) force(00%) fail(30%) ok(69%) skip(00%) nbruns=46
tcwg_simplebootstrap_build--master-arm-bootstrap-build SUCCESS (none) 01days 21hrs ago : #10540-gcc-R# FAILED artifacts/results/ email/jira/ log/status 01days 21hrs ago : #10540-gcc-R# FAILED 07days 14hrs ago : #10523-skip-scm-build 06days 20hrs ago : #10525-gcc-R# 00:21:32 make: *** [Makefile:1139: all] Error 2-force (bisect : gcc-53bcce7) 6.0 regressed(02%) force(04%) fail(32%) ok(58%) skip(02%) nbruns=46

time to build html = 0:02:23.565822