CI Infrastructure Status - tcwg_gnu_native.html

date = 2026-10-23 01:04:40.505905

config = CI-TCWG.yaml

LINKS

SUMMARY_TABLE (Last completed build only)

statistics on last-completed build of all jenkins job

last_run_date #success #failure #regressed
anytime 7 0 0
last-week 7 0 0
6-days-ago 0 0 0
5-days-ago 0 0 0
4-days-ago 0 0 0
3-days-ago 2 0 0
2-days-ago 5 0 0
1-days-ago 0 0 0
0-days-ago 0 0 0

SUMMARY_TABLE (All completed runs)

statistics on all completed builds of all jenkins job

last_run_date #success #failure #regressed #forced #reducing #aborted
anytime 73 79 0 12 8 0
last-week 37 4 0 7 0 0
6-days-ago 3 1 0 2 0 0
5-days-ago 9 2 0 1 0 0
4-days-ago 7 1 0 2 0 0
3-days-ago 7 0 0 0 0 0
2-days-ago 5 0 0 1 0 0
1-days-ago 0 0 0 0 0 0
0-days-ago 0 0 0 0 0 0

DETAILS_TABLE

help for the table format : here
project status last_build notify_verif last_success last_fail last_forced artifact_version statistics
tcwg_gnu_native_build--master-aarch64-build SUCCESS (none) 01days 19hrs ago : #10232-binutils-gcc-gdb-glibc-linux-R6 artifacts/results/ email/jira/ log/status 01days 19hrs ago : #10232-binutils-gcc-gdb-glibc-linux-R6 09days 18hrs ago : #10224 never 6.0 regressed(00%) force(00%) fail(31%) ok(68%) skip(00%) nbruns=19
tcwg_gnu_native_build--master-arm-build SUCCESS (none) 02days 04hrs ago : #10218-binutils-gcc-gdb-glibc-linux-R6 artifacts/results/ email/jira/ log/status 02days 04hrs ago : #10218-binutils-gcc-gdb-glibc-linux-R6 07days 23hrs ago : #10210-R# 00:30:11 make[2]: [Makefile:4322: install-common] Error 1 (ignored)-force 07days 14hrs ago : #10211-gcc-R# 00:42:58 make: *** [Makefile:1101: all] Error 2-force (bisect : gcc-0cb6acb) 6.0 regressed(09%) force(09%) fail(28%) ok(52%) skip(00%) nbruns=21
tcwg_gnu_native_check_binutils--master-aarch64-build SUCCESS (none) 02days 12hrs ago : #10205-binutils-gcc-gdb-glibc-linux-R0 artifacts/results/ email/jira/ log/status 02days 12hrs ago : #10205-binutils-gcc-gdb-glibc-linux-R0 09days 18hrs ago : #10197 never 6.0 regressed(00%) force(00%) fail(31%) ok(62%) skip(00%) nbruns=16
tcwg_gnu_native_check_binutils--master-arm-build SUCCESS (none) 02days 17hrs ago : #10198-binutils-gcc-gdb-glibc-linux-R0 artifacts/results/ email/jira/ log/status 02days 17hrs ago : #10198-binutils-gcc-gdb-glibc-linux-R0 05days 15hrs ago : #10195-binutils-gcc-gdb-glibc-linux-R# build_abe check_binutils --: never 6.0 regressed(00%) force(00%) fail(33%) ok(26%) skip(00%) nbruns=15
tcwg_gnu_native_check_gcc--master-aarch64-build FORCED (none) 01days 23hrs ago : #10418-R0-force artifacts/results/ email/jira/ log/status 01days 23hrs ago : #10418-R0-force 02days 03hrs ago : #10417-skip-scm-build 01days 23hrs ago : #10418-R0-force (bisect : gcc-3d0eda7) 6.0 regressed(16%) force(16%) fail(30%) ok(16%) skip(13%) nbruns=36
tcwg_gnu_native_check_gcc--master-arm-build UNSTABLE (check_gcc --) 02days 03hrs ago : #10201-binutils-gcc-gdb-glibc-linux-R# FAILED artifacts/results/ email/jira/ log/status never 02days 03hrs ago : #10201-binutils-gcc-gdb-glibc-linux-R# FAILED never -- regressed(00%) force(00%) fail(26%) ok(00%) skip(00%) nbruns=15
tcwg_gnu_native_check_gdb--master-aarch64-build SUCCESS (none) 02days 08hrs ago : #10221-binutils-gcc-gdb-glibc-linux-R0 artifacts/results/ email/jira/ log/status 02days 08hrs ago : #10221-binutils-gcc-gdb-glibc-linux-R0 09days 18hrs ago : #10213 never 6.0 regressed(00%) force(00%) fail(25%) ok(68%) skip(00%) nbruns=16
tcwg_gnu_native_check_gdb--master-arm-build SUCCESS (none) 02days 16hrs ago : #10222-binutils-gcc-gdb-glibc-linux-R0 artifacts/results/ email/jira/ log/status 02days 16hrs ago : #10222-binutils-gcc-gdb-glibc-linux-R0 05days 15hrs ago : #10219-binutils-gcc-gdb-glibc-linux-R# build_abe check_gdb -- --set check_buffer_workaround=gdb-read1: never 6.0 regressed(00%) force(00%) fail(33%) ok(26%) skip(00%) nbruns=15
tcwg_gnu_native_check_glibc--master-aarch64-build SUCCESS (none) 02days 00hrs ago : #10265-binutils-gcc-gdb-glibc-linux-R0 artifacts/results/ email/jira/ log/status 02days 00hrs ago : #10265-binutils-gcc-gdb-glibc-linux-R0 05days 21hrs ago : #10260-linux-R# 116 regressions-trigger-bisect 05days 06hrs ago : #10261-R# 116 regressions-force (bisect : linux-spurious) 6.0 regressed(26%) force(05%) fail(31%) ok(36%) skip(00%) nbruns=19
tcwg_gnu_native_check_glibc--master-arm-build BISECTING (check_regression) 01days 21hrs ago : #10265-linux-R# 118 regressions-trigger-bisect artifacts/results/ email/jira/ log/status 14days 22hrs ago : #10252-binutils-gcc-gdb-glibc-linux-R0 01days 21hrs ago : #10265-linux-R# 118 regressions-trigger-bisect never 6.0 regressed(27%) force(00%) fail(33%) ok(11%) skip(00%) nbruns=18
tcwg_gnu_native_fast_check_gcc--master-aarch64-build UNSTABLE (gcc) 02days 07hrs ago : #10205-binutils-gcc-gdb-glibc-linux-R# build_abe check_gcc -- --set runtestflags=compile.exp --set runtestflags=execute.exp: artifacts/results/ email/jira/ log/status 07days 00hrs ago : #10199-R0-force 02days 07hrs ago : #10205-binutils-gcc-gdb-glibc-linux-R# build_abe check_gcc -- --set runtestflags=compile.exp --set runtestflags=execute.exp: 07days 00hrs ago : #10199-R0-force (bisect : gcc-advance-baseline) 6.0 regressed(13%) force(04%) fail(31%) ok(13%) skip(09%) nbruns=22
tcwg_gnu_native_fast_check_gcc--master-arm-build UNSTABLE (gdb) 02days 09hrs ago : #10219-binutils-gcc-gdb-glibc-linux-R# build_abe check_gcc -- --set runtestflags=compile.exp --set runtestflags=execute.exp: artifacts/results/ email/jira/ log/status 14days 02hrs ago : #10208-binutils-gdb-glibc-R0 02days 09hrs ago : #10219-binutils-gcc-gdb-glibc-linux-R# build_abe check_gcc -- --set runtestflags=compile.exp --set runtestflags=execute.exp: 15days 02hrs ago : #10205-gcc-R# 1 regressions-force (bisect : gcc-5f9f871) 6.0 regressed(04%) force(09%) fail(27%) ok(09%) skip(04%) nbruns=22
tcwg_gnu_native_fast_check_gdb--master-aarch64-build UNSTABLE (gcc) 01days 23hrs ago : #10199-binutils-gcc-gdb-glibc-linux-R# build_abe check_gdb -- --set runtestflags=gdb.base/break-always.exp --set runtestflags=gdb.base/break-caller-line.exp --set runtestflags=gdb.base/break-entry.exp --set runtestflags=gdb.base/break.exp --set runtestflags=gdb.base/break-fun-addr.exp --set runtestflags=gdb.base/break-idempotent.exp --set runtestflags=gdb.base/break-include.exp --set runtestflags=gdb.base/break-inline.exp --set runtestflags=gdb.base/break-main-file-remove-fail.exp --set runtestflags=gdb.base/break-on-linker-gcd-function.exp --set runtestflags=gdb.base/breakpoint-in-ro-region.exp --set runtestflags=gdb.base/breakpoint-shadow.exp --set runtestflags=gdb.base/break-probes.exp --set runtestflags=gdb.gdb/unittest.exp --set check_buffer_workaround=gdb-read1: artifacts/results/ email/jira/ log/status 08days 23hrs ago : #10192-binutils-gcc-gdb-glibc-linux-R0 01days 23hrs ago : #10199-binutils-gcc-gdb-glibc-linux-R# build_abe check_gdb -- --set runtestflags=gdb.base/break-always.exp --set runtestflags=gdb.base/break-caller-line.exp --set runtestflags=gdb.base/break-entry.exp --set runtestflags=gdb.base/break.exp --set runtestflags=gdb.base/break-fun-addr.exp --set runtestflags=gdb.base/break-idempotent.exp --set runtestflags=gdb.base/break-include.exp --set runtestflags=gdb.base/break-inline.exp --set runtestflags=gdb.base/break-main-file-remove-fail.exp --set runtestflags=gdb.base/break-on-linker-gcd-function.exp --set runtestflags=gdb.base/breakpoint-in-ro-region.exp --set runtestflags=gdb.base/breakpoint-shadow.exp --set runtestflags=gdb.base/break-probes.exp --set runtestflags=gdb.gdb/unittest.exp --set check_buffer_workaround=gdb-read1: never 6.0 regressed(00%) force(00%) fail(26%) ok(26%) skip(00%) nbruns=15
tcwg_gnu_native_fast_check_gdb--master-arm-build UNSTABLE (gcc) 02days 02hrs ago : #10199-binutils-gcc-gdb-glibc-linux-R# build_abe check_gdb -- --set runtestflags=gdb.base/break-always.exp --set runtestflags=gdb.base/break-caller-line.exp --set runtestflags=gdb.base/break-entry.exp --set runtestflags=gdb.base/break.exp --set runtestflags=gdb.base/break-fun-addr.exp --set runtestflags=gdb.base/break-idempotent.exp --set runtestflags=gdb.base/break-include.exp --set runtestflags=gdb.base/break-inline.exp --set runtestflags=gdb.base/break-main-file-remove-fail.exp --set runtestflags=gdb.base/break-on-linker-gcd-function.exp --set runtestflags=gdb.base/breakpoint-in-ro-region.exp --set runtestflags=gdb.base/breakpoint-shadow.exp --set runtestflags=gdb.base/break-probes.exp --set runtestflags=gdb.gdb/unittest.exp --set check_buffer_workaround=gdb-read1: artifacts/results/ email/jira/ log/status 14days 22hrs ago : #10189-binutils-gcc-gdb-glibc-linux-R0 02days 02hrs ago : #10199-binutils-gcc-gdb-glibc-linux-R# build_abe check_gdb -- --set runtestflags=gdb.base/break-always.exp --set runtestflags=gdb.base/break-caller-line.exp --set runtestflags=gdb.base/break-entry.exp --set runtestflags=gdb.base/break.exp --set runtestflags=gdb.base/break-fun-addr.exp --set runtestflags=gdb.base/break-idempotent.exp --set runtestflags=gdb.base/break-include.exp --set runtestflags=gdb.base/break-inline.exp --set runtestflags=gdb.base/break-main-file-remove-fail.exp --set runtestflags=gdb.base/break-on-linker-gcd-function.exp --set runtestflags=gdb.base/breakpoint-in-ro-region.exp --set runtestflags=gdb.base/breakpoint-shadow.exp --set runtestflags=gdb.base/break-probes.exp --set runtestflags=gdb.gdb/unittest.exp --set check_buffer_workaround=gdb-read1: never 6.0 regressed(00%) force(00%) fail(26%) ok(13%) skip(00%) nbruns=15

time to build html = 0:04:38.584045