CI Infrastructure Status - tcwg_bootstrap.html

date = 2026-09-09 22:02:44.216053

config = CI-TCWG.yaml

LINKS

SUMMARY_TABLE (Last completed build only)

statistics on last-completed build of all jenkins job

last_run_date #success #failure #regressed
anytime 18 2 0
last-week 18 2 0
6-days-ago 0 0 0
5-days-ago 0 0 0
4-days-ago 0 0 0
3-days-ago 0 0 0
2-days-ago 0 0 0
1-days-ago 10 2 0
0-days-ago 8 0 0

SUMMARY_TABLE (All completed runs)

statistics on all completed builds of all jenkins job

last_run_date #success #failure #regressed #forced #reducing #aborted
anytime 352 40 0 14 6 0
last-week 137 14 0 4 2 0
6-days-ago 19 2 0 2 2 0
5-days-ago 19 2 0 0 0 0
4-days-ago 17 2 0 0 0 0
3-days-ago 18 2 0 0 0 0
2-days-ago 22 2 0 0 0 0
1-days-ago 18 2 0 0 0 0
0-days-ago 8 0 0 0 0 0

DETAILS_TABLE

help for the table format : here
project status last_build notify_verif last_success last_fail last_forced artifact_version statistics
tcwg_bootstrap_build--master-aarch64-bootstrap_debug-build SUCCESS (none) 00days 17hrs ago : #10171-gcc-R1 artifacts/results/ email/jira/ log/status 00days 17hrs ago : #10171-gcc-R1 08days 15hrs ago : #10162-gcc-R# 00:22:34 make: *** [Makefile:1140: all] Error 2-trigger-bisect 08days 06hrs ago : #10163-R1-force (bisect : gcc-spurious) 6.0 regressed(04%) force(04%) fail(00%) ok(90%) skip(00%) nbruns=21
tcwg_bootstrap_build--master-aarch64-bootstrap_lto-build SUCCESS (none) 00days 11hrs ago : #10163-gcc-R1 artifacts/results/ email/jira/ log/status 00days 11hrs ago : #10163-gcc-R1 never never 6.0 regressed(00%) force(00%) fail(00%) ok(100%) skip(00%) nbruns=20
tcwg_bootstrap_build--master-aarch64-bootstrap_O1-build SUCCESS (none) 00days 13hrs ago : #10159-gcc-R1 artifacts/results/ email/jira/ log/status 00days 13hrs ago : #10159-gcc-R1 never never 6.0 regressed(00%) force(00%) fail(00%) ok(100%) skip(00%) nbruns=20
tcwg_bootstrap_build--master-aarch64-bootstrap_O3-build SUCCESS (none) 00days 23hrs ago : #10160-gcc-R1 artifacts/results/ email/jira/ log/status 00days 23hrs ago : #10160-gcc-R1 never never 6.0 regressed(00%) force(00%) fail(00%) ok(100%) skip(00%) nbruns=20
tcwg_bootstrap_build--master-aarch64-bootstrap_profiled-build SUCCESS (none) 00days 19hrs ago : #10160-gcc-R1 artifacts/results/ email/jira/ log/status 00days 19hrs ago : #10160-gcc-R1 never never 6.0 regressed(00%) force(00%) fail(00%) ok(100%) skip(00%) nbruns=20
tcwg_bootstrap_build--master-aarch64-bootstrap_profiled_lto-build SUCCESS (none) 00days 16hrs ago : #10160-gcc-R1 artifacts/results/ email/jira/ log/status 00days 16hrs ago : #10160-gcc-R1 never never 6.0 regressed(00%) force(00%) fail(00%) ok(100%) skip(00%) nbruns=20
tcwg_bootstrap_build--master-aarch64-bootstrap_profiled_lto_lean-build SUCCESS (none) 00days 08hrs ago : #10160-gcc-R1 artifacts/results/ email/jira/ log/status 00days 08hrs ago : #10160-gcc-R1 never never 6.0 regressed(00%) force(00%) fail(00%) ok(100%) skip(00%) nbruns=20
tcwg_bootstrap_build--master-aarch64-bootstrap_ubsan-build SUCCESS (none) 00days 06hrs ago : #10166-gcc-R1 artifacts/results/ email/jira/ log/status 00days 06hrs ago : #10166-gcc-R1 07days 00hrs ago : #10156-gcc-R# 01:01:36 make: *** [Makefile:1140: all] Error 2-trigger-bisect 06days 00hrs ago : #10158-gcc-R# 01:13:10 make: *** [Makefile:1140: all] Error 2-force (bisect : gcc-8858cb3) 6.0 regressed(04%) force(08%) fail(00%) ok(86%) skip(00%) nbruns=23
tcwg_bootstrap_build--master-arm-bootstrap_debug-build SUCCESS (none) 00days 13hrs ago : #10159-gcc-R1 artifacts/results/ email/jira/ log/status 00days 13hrs ago : #10159-gcc-R1 never never 6.0 regressed(00%) force(00%) fail(00%) ok(100%) skip(00%) nbruns=20
tcwg_bootstrap_build--master-arm-bootstrap_lto-build SUCCESS (none) 00days 07hrs ago : #10162-gcc-R1 artifacts/results/ email/jira/ log/status 00days 07hrs ago : #10162-gcc-R1 never never 6.0 regressed(00%) force(00%) fail(00%) ok(100%) skip(00%) nbruns=20
tcwg_bootstrap_build--master-arm-bootstrap_O1-build SUCCESS (none) 00days 09hrs ago : #10160-gcc-R1 artifacts/results/ email/jira/ log/status 00days 09hrs ago : #10160-gcc-R1 never never 6.0 regressed(00%) force(00%) fail(00%) ok(100%) skip(00%) nbruns=20
tcwg_bootstrap_build--master-arm-bootstrap_O3-build SUCCESS (none) 01days 00hrs ago : #10162-gcc-R1 artifacts/results/ email/jira/ log/status 01days 00hrs ago : #10162-gcc-R1 never never 6.0 regressed(00%) force(00%) fail(00%) ok(100%) skip(00%) nbruns=20
tcwg_bootstrap_build--master-arm-bootstrap_profiled-build SUCCESS (none) 00days 04hrs ago : #10159-gcc-R1 artifacts/results/ email/jira/ log/status 00days 04hrs ago : #10159-gcc-R1 never never 6.0 regressed(00%) force(00%) fail(00%) ok(100%) skip(00%) nbruns=20
tcwg_bootstrap_build--master-arm-bootstrap_profiled_lto-build SUCCESS (none) 00days 12hrs ago : #10162-gcc-R1 artifacts/results/ email/jira/ log/status 00days 12hrs ago : #10162-gcc-R1 never never 6.0 regressed(00%) force(00%) fail(00%) ok(100%) skip(00%) nbruns=20
tcwg_bootstrap_build--master-arm-bootstrap_profiled_lto_lean-build SUCCESS (none) 00days 05hrs ago : #10160-gcc-R1 artifacts/results/ email/jira/ log/status 00days 05hrs ago : #10160-gcc-R1 never never 6.0 regressed(00%) force(00%) fail(00%) ok(100%) skip(00%) nbruns=20
tcwg_bootstrap_build--master-arm-bootstrap_ubsan-build SUCCESS (none) 00days 18hrs ago : #10163-gcc-R1 artifacts/results/ email/jira/ log/status 00days 18hrs ago : #10163-gcc-R1 07days 15hrs ago : #10153-gcc-R# 01:03:13 make: *** [Makefile:1140: all] Error 2-trigger-bisect 06days 14hrs ago : #10155-gcc-R# 00:52:21 make: *** [Makefile:1140: all] Error 2-force (bisect : gcc-8858cb3) 6.0 regressed(04%) force(08%) fail(00%) ok(86%) skip(00%) nbruns=23
tcwg_bootstrap_check--master-aarch64-check_bootstrap-build SUCCESS (none) 00days 08hrs ago : #10257-gcc-R0 artifacts/results/ email/jira/ log/status 00days 08hrs ago : #10257-gcc-R0 08days 16hrs ago : #10248-gcc-R# build_abe check_bootstrap --: 09days 04hrs ago : #10246-gcc-R# 2 regressions-force (bisect : gcc-2c1e972) 6.0 regressed(07%) force(15%) fail(00%) ok(69%) skip(00%) nbruns=26
tcwg_bootstrap_check--master-aarch64-check_bootstrap_lto-build SUCCESS (none) 00days 14hrs ago : #10256-gcc-R0 artifacts/results/ email/jira/ log/status 00days 14hrs ago : #10256-gcc-R0 10days 13hrs ago : #10243-gcc-R# 2 regressions-trigger-bisect 09days 14hrs ago : #10245-gcc-R# 2 regressions-force (bisect : gcc-2c1e972) 6.0 regressed(07%) force(15%) fail(00%) ok(76%) skip(00%) nbruns=26
tcwg_bootstrap_check--master-arm-check_bootstrap-build FAILURE (round-robin-baseline.sh) 00days 17hrs ago : #10161-gcc artifacts/results/ email/jira/ log/status never 00days 17hrs ago : #10161-gcc never -- regressed(00%) force(00%) fail(100%) ok(00%) skip(00%) nbruns=20
tcwg_bootstrap_check--master-arm-check_bootstrap_lto-build FAILURE (round-robin-baseline.sh) 00days 17hrs ago : #10162-gcc artifacts/results/ email/jira/ log/status 133days 12hrs ago : #10027-R# 24 regressions-force 00days 17hrs ago : #10162-gcc 133days 12hrs ago : #10027-R# 24 regressions-force (bisect : gcc-21d1bb1) 6.0 (not-completed) regressed(00%) force(04%) fail(95%) ok(00%) skip(00%) nbruns=21

time to build html = 0:02:42.688151