CI Infrastructure Status - tcwg_gnu.html

date = 2026-10-23 00:23:59.343378

config = CI-TCWG.yaml

LINKS

SUMMARY_TABLE (Last completed build only)

statistics on last-completed build of all jenkins job

last_run_date #success #failure #regressed
anytime 33 0 0
last-week 33 0 0
6-days-ago 0 0 0
5-days-ago 0 0 0
4-days-ago 0 0 0
3-days-ago 4 0 0
2-days-ago 10 0 0
1-days-ago 11 0 0
0-days-ago 8 0 0

SUMMARY_TABLE (All completed runs)

statistics on all completed builds of all jenkins job

last_run_date #success #failure #regressed #forced #reducing #aborted
anytime 337 254 0 155 9 1
last-week 145 74 0 71 1 1
6-days-ago 17 6 0 14 0 0
5-days-ago 18 16 0 11 0 1
4-days-ago 16 24 0 5 0 0
3-days-ago 26 11 0 7 1 0
2-days-ago 18 3 0 9 0 0
1-days-ago 17 5 0 8 0 0
0-days-ago 8 2 0 3 0 0

DETAILS_TABLE

help for the table format : here
project status last_build notify_verif last_success last_fail last_forced artifact_version statistics
tcwg_gnu_cross_build--master-aarch64-build SUCCESS (none) 00days 06hrs ago : #10239-binutils-gcc-gdb-glibc-linux-qemu-R7 artifacts/results/ email/jira/ log/status 00days 06hrs ago : #10239-binutils-gcc-gdb-glibc-linux-qemu-R7 04days 08hrs ago : #10235 never 6.0 regressed(00%) force(00%) fail(25%) ok(75%) skip(00%) nbruns=20
tcwg_gnu_cross_build--master-arm-build SUCCESS (none) 00days 20hrs ago : #10230-binutils-gcc-gdb-glibc-linux-qemu-R7 artifacts/results/ email/jira/ log/status 00days 20hrs ago : #10230-binutils-gcc-gdb-glibc-linux-qemu-R7 04days 00hrs ago : #10227 never 6.0 regressed(00%) force(00%) fail(25%) ok(75%) skip(00%) nbruns=20
tcwg_gnu_cross_check_binutils--master-aarch64-build SUCCESS (none) 00days 14hrs ago : #10214-binutils-gcc-gdb-glibc-linux-qemu-R0 artifacts/results/ email/jira/ log/status 00days 14hrs ago : #10214-binutils-gcc-gdb-glibc-linux-qemu-R0 03days 17hrs ago : #10211 never 6.0 regressed(00%) force(00%) fail(30%) ok(70%) skip(00%) nbruns=20
tcwg_gnu_cross_check_binutils--master-arm-build SUCCESS (none) 00days 01hrs ago : #10219-binutils-gcc-gdb-glibc-linux-qemu-R0 artifacts/results/ email/jira/ log/status 00days 01hrs ago : #10219-binutils-gcc-gdb-glibc-linux-qemu-R0 04days 05hrs ago : #10215 never 6.0 regressed(00%) force(00%) fail(25%) ok(75%) skip(00%) nbruns=20
tcwg_gnu_cross_check_gcc--master-aarch64-build BISECTING (check_regression) 00days 06hrs ago : #10510-gcc-R# 14 regressions-trigger-bisect artifacts/results/ email/jira/ log/status 00days 14hrs ago : #10509-binutils-gdb-glibc-qemu-R0 00days 06hrs ago : #10510-gcc-R# 14 regressions-trigger-bisect 01days 08hrs ago : #10506-gcc-R# 3 regressions-force (bisect : gcc-4eda76c) 6.0 regressed(14%) force(22%) fail(25%) ok(17%) skip(20%) nbruns=63
tcwg_gnu_cross_check_gcc--master-arm-build UNSTABLE 00days 02hrs ago : #10538-skip-scm-build artifacts/results/ email/jira/ log/status 00days 18hrs ago : #10536-gcc-R# 57 regressions-force 00days 02hrs ago : #10538-skip-scm-build 00days 18hrs ago : #10536-gcc-R# 57 regressions-force (bisect : gcc-53bcce7) 6.0 regressed(15%) force(27%) fail(24%) ok(15%) skip(15%) nbruns=77
tcwg_gnu_embed_build--master-arm_eabi-build SUCCESS (none) 02days 11hrs ago : #10059-binutils-gcc-gdb-newlib-qemu-R7 artifacts/results/ email/jira/ log/status 02days 11hrs ago : #10059-binutils-gcc-gdb-newlib-qemu-R7 17days 12hrs ago : #10054 never 6.0 regressed(00%) force(00%) fail(16%) ok(83%) skip(00%) nbruns=6
tcwg_gnu_embed_build--master-arm_v7a_softfp_eabi-build SUCCESS (none) 02days 17hrs ago : #10059-binutils-gcc-gdb-newlib-qemu-R7 artifacts/results/ email/jira/ log/status 02days 17hrs ago : #10059-binutils-gcc-gdb-newlib-qemu-R7 17days 17hrs ago : #10054 never 6.0 regressed(00%) force(00%) fail(16%) ok(83%) skip(00%) nbruns=6
tcwg_gnu_embed_build--master-thumb_m0_soft_eabi-build SUCCESS (none) 00days 01hrs ago : #10067-binutils-gcc-gdb-newlib-qemu-R7 artifacts/results/ email/jira/ log/status 00days 01hrs ago : #10067-binutils-gcc-gdb-newlib-qemu-R7 18days 03hrs ago : #10061 never 6.0 regressed(00%) force(00%) fail(14%) ok(85%) skip(00%) nbruns=7
tcwg_gnu_embed_build--master-thumb_m23_soft_eabi-build SUCCESS (none) 01days 03hrs ago : #10064-binutils-gcc-gdb-newlib-qemu-R7 artifacts/results/ email/jira/ log/status 01days 03hrs ago : #10064-binutils-gcc-gdb-newlib-qemu-R7 19days 06hrs ago : #10058 never 6.0 regressed(00%) force(00%) fail(14%) ok(85%) skip(00%) nbruns=7
tcwg_gnu_embed_build--master-thumb_m33_hard_eabi-build SUCCESS (none) 00days 09hrs ago : #10072-binutils-gcc-gdb-newlib-qemu-R7 artifacts/results/ email/jira/ log/status 00days 09hrs ago : #10072-binutils-gcc-gdb-newlib-qemu-R7 18days 13hrs ago : #10066 never 6.0 regressed(00%) force(00%) fail(14%) ok(85%) skip(00%) nbruns=7
tcwg_gnu_embed_build--master-thumb_m3_softfp_eabi-build SUCCESS (none) 03days 01hrs ago : #10066-binutils-gcc-gdb-newlib-qemu-R7 artifacts/results/ email/jira/ log/status 03days 01hrs ago : #10066-binutils-gcc-gdb-newlib-qemu-R7 18days 01hrs ago : #10061 never 6.0 regressed(00%) force(00%) fail(16%) ok(83%) skip(00%) nbruns=6
tcwg_gnu_embed_build--master-thumb_m55_hard_eabi-build SUCCESS (none) 01days 20hrs ago : #10059-binutils-gcc-gdb-newlib-qemu-R7 artifacts/results/ email/jira/ log/status 01days 20hrs ago : #10059-binutils-gcc-gdb-newlib-qemu-R7 16days 22hrs ago : #10054 never 6.0 regressed(00%) force(00%) fail(28%) ok(71%) skip(00%) nbruns=7
tcwg_gnu_embed_build--master-thumb_m7_hard_eabi-build SUCCESS (none) 01days 22hrs ago : #10059-binutils-gcc-gdb-newlib-qemu-R7 artifacts/results/ email/jira/ log/status 01days 22hrs ago : #10059-binutils-gcc-gdb-newlib-qemu-R7 16days 23hrs ago : #10054 never 6.0 regressed(00%) force(00%) fail(28%) ok(71%) skip(00%) nbruns=7
tcwg_gnu_embed_build--master-thumb_v8a_hard_eabi-build SUCCESS (none) 00days 01hrs ago : #10067-binutils-gcc-gdb-newlib-qemu-R7 artifacts/results/ email/jira/ log/status 00days 01hrs ago : #10067-binutils-gcc-gdb-newlib-qemu-R7 15days 02hrs ago : #10062 never 6.0 regressed(00%) force(00%) fail(28%) ok(71%) skip(00%) nbruns=7
tcwg_gnu_embed_check_binutils--master-arm_eabi-build SUCCESS (none) 01days 18hrs ago : #10059-binutils-gcc-gdb-newlib-qemu-R0 artifacts/results/ email/jira/ log/status 01days 18hrs ago : #10059-binutils-gcc-gdb-newlib-qemu-R0 04days 19hrs ago : #10058 never 6.0 regressed(00%) force(00%) fail(42%) ok(57%) skip(00%) nbruns=7
tcwg_gnu_embed_check_binutils--master-arm_v7a_softfp_eabi-build SUCCESS (none) 00days 21hrs ago : #10061-binutils-gcc-gdb-newlib-qemu-R0 artifacts/results/ email/jira/ log/status 00days 21hrs ago : #10061-binutils-gcc-gdb-newlib-qemu-R0 04days 01hrs ago : #10060 never 6.0 regressed(00%) force(00%) fail(28%) ok(71%) skip(00%) nbruns=7
tcwg_gnu_embed_check_binutils--master-thumb_m0_soft_eabi-build SUCCESS (none) 00days 17hrs ago : #10068-binutils-gcc-gdb-newlib-qemu-R0 artifacts/results/ email/jira/ log/status 00days 17hrs ago : #10068-binutils-gcc-gdb-newlib-qemu-R0 18days 19hrs ago : #10062 never 6.0 regressed(00%) force(00%) fail(14%) ok(85%) skip(00%) nbruns=7
tcwg_gnu_embed_check_binutils--master-thumb_m23_soft_eabi-build SUCCESS (none) 01days 08hrs ago : #10060-binutils-gcc-gdb-newlib-qemu-R0 artifacts/results/ email/jira/ log/status 01days 08hrs ago : #10060-binutils-gcc-gdb-newlib-qemu-R0 19days 09hrs ago : #10054 never 6.0 regressed(00%) force(00%) fail(14%) ok(85%) skip(00%) nbruns=7
tcwg_gnu_embed_check_binutils--master-thumb_m33_hard_eabi-build SUCCESS (none) 00days 02hrs ago : #10067-binutils-gcc-gdb-newlib-qemu-R0 artifacts/results/ email/jira/ log/status 00days 02hrs ago : #10067-binutils-gcc-gdb-newlib-qemu-R0 18days 07hrs ago : #10061 never 6.0 regressed(00%) force(00%) fail(14%) ok(85%) skip(00%) nbruns=7
tcwg_gnu_embed_check_binutils--master-thumb_m3_softfp_eabi-build SUCCESS (none) 00days 21hrs ago : #10061-binutils-gcc-gdb-newlib-qemu-R0 artifacts/results/ email/jira/ log/status 00days 21hrs ago : #10061-binutils-gcc-gdb-newlib-qemu-R0 04days 00hrs ago : #10060 never 6.0 regressed(00%) force(00%) fail(28%) ok(71%) skip(00%) nbruns=7
tcwg_gnu_embed_check_binutils--master-thumb_m55_hard_eabi-build SUCCESS (none) 00days 17hrs ago : #10068-binutils-gcc-gdb-newlib-qemu-R0 artifacts/results/ email/jira/ log/status 00days 17hrs ago : #10068-binutils-gcc-gdb-newlib-qemu-R0 03days 19hrs ago : #10067 never 6.0 regressed(00%) force(00%) fail(28%) ok(71%) skip(00%) nbruns=7
tcwg_gnu_embed_check_binutils--master-thumb_m7_hard_eabi-build SUCCESS (none) 00days 19hrs ago : #10068-binutils-gcc-gdb-newlib-qemu-R0 artifacts/results/ email/jira/ log/status 00days 19hrs ago : #10068-binutils-gcc-gdb-newlib-qemu-R0 18days 23hrs ago : #10062 never 6.0 regressed(00%) force(00%) fail(14%) ok(85%) skip(00%) nbruns=7
tcwg_gnu_embed_check_binutils--master-thumb_v8a_hard_eabi-build SUCCESS (none) 00days 16hrs ago : #10068-binutils-gcc-gdb-newlib-qemu-R0 artifacts/results/ email/jira/ log/status 00days 16hrs ago : #10068-binutils-gcc-gdb-newlib-qemu-R0 03days 18hrs ago : #10067 never 6.0 regressed(00%) force(00%) fail(28%) ok(71%) skip(00%) nbruns=7
tcwg_gnu_embed_check_gcc--master-arm_eabi-build FORCED (none) 00days 07hrs ago : #10271-gcc-R# 1 regressions-force artifacts/results/ email/jira/ log/status 00days 07hrs ago : #10271-gcc-R# 1 regressions-force 01days 23hrs ago : #10269-gcc-R# 21 regressions-trigger-bisect 00days 07hrs ago : #10271-gcc-R# 1 regressions-force (bisect : gcc-3d0eda7) 6.0 regressed(15%) force(27%) fail(27%) ok(24%) skip(03%) nbruns=33
tcwg_gnu_embed_check_gcc--master-arm_v7a_softfp_eabi-build SUCCESS (none) 01days 05hrs ago : #10297-binutils-gcc-gdb-newlib-qemu-R0 artifacts/results/ email/jira/ log/status 01days 05hrs ago : #10297-binutils-gcc-gdb-newlib-qemu-R0 02days 08hrs ago : #10294-gcc-R# 17 regressions-trigger-bisect 01days 09hrs ago : #10296-gcc-R# 1 regressions-force (bisect : gcc-3d0eda7) 6.0 regressed(18%) force(30%) fail(24%) ok(24%) skip(03%) nbruns=33
tcwg_gnu_embed_check_gcc--master-thumb_m0_soft_eabi-build UNSTABLE 00days 00hrs ago : #10284-skip-scm-build artifacts/results/ email/jira/ log/status 00days 19hrs ago : #10282-binutils-gdb-newlib-R0 00days 00hrs ago : #10284-skip-scm-build 01days 05hrs ago : #10280-gcc-R# 16 regressions-force (bisect : gcc-a484431) 6.0 regressed(19%) force(31%) fail(21%) ok(23%) skip(03%) nbruns=51
tcwg_gnu_embed_check_gcc--master-thumb_m23_soft_eabi-build FORCED (none) 00days 05hrs ago : #10259-R0-force artifacts/results/ email/jira/ log/status 00days 05hrs ago : #10259-R0-force 00days 17hrs ago : #10258-gcc-R# 5 regressions-trigger-bisect 00days 05hrs ago : #10259-R0-force (bisect : gcc-53bcce7) 6.0 regressed(17%) force(28%) fail(28%) ok(23%) skip(00%) nbruns=39
tcwg_gnu_embed_check_gcc--master-thumb_m33_hard_eabi-build SUCCESS (none) 00days 01hrs ago : #10274-binutils-gdb-newlib-qemu-R0 artifacts/results/ email/jira/ log/status 00days 01hrs ago : #10274-binutils-gdb-newlib-qemu-R0 00days 07hrs ago : #10273-binutils-gcc-gdb-newlib-qemu-R# 4 regressions 02days 20hrs ago : #10269-gcc-R# 1 regressions-force (bisect : gcc-3d0eda7) 6.0 regressed(17%) force(28%) fail(26%) ok(26%) skip(02%) nbruns=46
tcwg_gnu_embed_check_gcc--master-thumb_m3_softfp_eabi-build FORCED (none) 00days 12hrs ago : #10314-R0-force artifacts/results/ email/jira/ log/status 00days 12hrs ago : #10314-R0-force 01days 20hrs ago : #10313-gcc-R# 16 regressions-trigger-bisect 00days 12hrs ago : #10314-R0-force (bisect : gcc-spurious) 6.0 regressed(17%) force(32%) fail(28%) ok(21%) skip(00%) nbruns=46
tcwg_gnu_embed_check_gcc--master-thumb_m55_hard_eabi-build SUCCESS (none) 01days 15hrs ago : #10233-binutils-gcc-gdb-newlib-qemu-R0 artifacts/results/ email/jira/ log/status 01days 15hrs ago : #10233-binutils-gcc-gdb-newlib-qemu-R0 02days 09hrs ago : #10230-gcc-R# 17 regressions-trigger-bisect 01days 20hrs ago : #10232-gcc-R# 1 regressions-force (bisect : gcc-3d0eda7) 6.0 regressed(17%) force(29%) fail(26%) ok(24%) skip(02%) nbruns=41
tcwg_gnu_embed_check_gcc--master-thumb_m7_hard_eabi-build SUCCESS (none) 00days 08hrs ago : #10284-binutils-gcc-gdb-newlib-qemu-R0 artifacts/results/ email/jira/ log/status 00days 08hrs ago : #10284-binutils-gcc-gdb-newlib-qemu-R0 01days 10hrs ago : #10283 01days 13hrs ago : #10282-gcc-R# 16 regressions-force (bisect : gcc-a484431) 6.0 regressed(17%) force(30%) fail(23%) ok(25%) skip(02%) nbruns=39
tcwg_gnu_embed_check_gcc--master-thumb_v8a_hard_eabi-build BISECTING (check_regression) 00days 09hrs ago : #10295-gcc-R# 4 regressions-trigger-bisect artifacts/results/ email/jira/ log/status 00days 14hrs ago : #10294-binutils-gdb-newlib-qemu-R0 00days 09hrs ago : #10295-gcc-R# 4 regressions-trigger-bisect 04days 04hrs ago : #10288-gcc-R# 1 regressions-force (bisect : gcc-3d0eda7) 6.0 regressed(22%) force(27%) fail(25%) ok(22%) skip(02%) nbruns=36
tcwg_gnu_mingw_build--master-woa64-build never never - never never never -- --
tcwg_gnu_mingw_check_binutils--master-woa64-build never never - never never never -- --
tcwg_gnu_mingw_check_gcc--master-woa64-build never never - never never never -- --
tcwg_gnu_native_build--master-aarch64-build SUCCESS (none) 01days 18hrs ago : #10232-binutils-gcc-gdb-glibc-linux-R6 artifacts/results/ email/jira/ log/status 01days 18hrs ago : #10232-binutils-gcc-gdb-glibc-linux-R6 09days 17hrs ago : #10224 never 6.0 regressed(00%) force(00%) fail(31%) ok(68%) skip(00%) nbruns=19
tcwg_gnu_native_build--master-arm-build SUCCESS (none) 02days 03hrs ago : #10218-binutils-gcc-gdb-glibc-linux-R6 artifacts/results/ email/jira/ log/status 02days 03hrs ago : #10218-binutils-gcc-gdb-glibc-linux-R6 07days 22hrs ago : #10210-R# 00:30:11 make[2]: [Makefile:4322: install-common] Error 1 (ignored)-force 07days 13hrs ago : #10211-gcc-R# 00:42:58 make: *** [Makefile:1101: all] Error 2-force (bisect : gcc-0cb6acb) 6.0 regressed(09%) force(09%) fail(28%) ok(52%) skip(00%) nbruns=21
tcwg_gnu_native_check_binutils--master-aarch64-build SUCCESS (none) 02days 11hrs ago : #10205-binutils-gcc-gdb-glibc-linux-R0 artifacts/results/ email/jira/ log/status 02days 11hrs ago : #10205-binutils-gcc-gdb-glibc-linux-R0 09days 17hrs ago : #10197 never 6.0 regressed(00%) force(00%) fail(31%) ok(62%) skip(00%) nbruns=16
tcwg_gnu_native_check_binutils--master-arm-build SUCCESS (none) 02days 16hrs ago : #10198-binutils-gcc-gdb-glibc-linux-R0 artifacts/results/ email/jira/ log/status 02days 16hrs ago : #10198-binutils-gcc-gdb-glibc-linux-R0 05days 15hrs ago : #10195-binutils-gcc-gdb-glibc-linux-R# build_abe check_binutils --: never 6.0 regressed(00%) force(00%) fail(33%) ok(26%) skip(00%) nbruns=15
tcwg_gnu_native_check_gcc--master-aarch64-build FORCED (none) 01days 22hrs ago : #10418-R0-force artifacts/results/ email/jira/ log/status 01days 22hrs ago : #10418-R0-force 02days 02hrs ago : #10417-skip-scm-build 01days 22hrs ago : #10418-R0-force (bisect : gcc-3d0eda7) 6.0 regressed(16%) force(16%) fail(30%) ok(16%) skip(13%) nbruns=36
tcwg_gnu_native_check_gcc--master-arm-build UNSTABLE (check_gcc --) 02days 02hrs ago : #10201-binutils-gcc-gdb-glibc-linux-R# FAILED artifacts/results/ email/jira/ log/status never 02days 02hrs ago : #10201-binutils-gcc-gdb-glibc-linux-R# FAILED never -- regressed(00%) force(00%) fail(26%) ok(00%) skip(00%) nbruns=15
tcwg_gnu_native_check_gdb--master-aarch64-build SUCCESS (none) 02days 07hrs ago : #10221-binutils-gcc-gdb-glibc-linux-R0 artifacts/results/ email/jira/ log/status 02days 07hrs ago : #10221-binutils-gcc-gdb-glibc-linux-R0 09days 17hrs ago : #10213 never 6.0 regressed(00%) force(00%) fail(25%) ok(68%) skip(00%) nbruns=16
tcwg_gnu_native_check_gdb--master-arm-build SUCCESS (none) 02days 16hrs ago : #10222-binutils-gcc-gdb-glibc-linux-R0 artifacts/results/ email/jira/ log/status 02days 16hrs ago : #10222-binutils-gcc-gdb-glibc-linux-R0 05days 15hrs ago : #10219-binutils-gcc-gdb-glibc-linux-R# build_abe check_gdb -- --set check_buffer_workaround=gdb-read1: never 6.0 regressed(00%) force(00%) fail(33%) ok(26%) skip(00%) nbruns=15
tcwg_gnu_native_check_glibc--master-aarch64-build SUCCESS (none) 01days 23hrs ago : #10265-binutils-gcc-gdb-glibc-linux-R0 artifacts/results/ email/jira/ log/status 01days 23hrs ago : #10265-binutils-gcc-gdb-glibc-linux-R0 05days 20hrs ago : #10260-linux-R# 116 regressions-trigger-bisect 05days 06hrs ago : #10261-R# 116 regressions-force (bisect : linux-spurious) 6.0 regressed(26%) force(05%) fail(31%) ok(36%) skip(00%) nbruns=19
tcwg_gnu_native_check_glibc--master-arm-build BISECTING (check_regression) 01days 20hrs ago : #10265-linux-R# 118 regressions-trigger-bisect artifacts/results/ email/jira/ log/status 14days 21hrs ago : #10252-binutils-gcc-gdb-glibc-linux-R0 01days 20hrs ago : #10265-linux-R# 118 regressions-trigger-bisect never 6.0 regressed(27%) force(00%) fail(33%) ok(11%) skip(00%) nbruns=18
tcwg_gnu_native_fast_check_gcc--master-aarch64-build UNSTABLE (gcc) 02days 06hrs ago : #10205-binutils-gcc-gdb-glibc-linux-R# build_abe check_gcc -- --set runtestflags=compile.exp --set runtestflags=execute.exp: artifacts/results/ email/jira/ log/status 06days 23hrs ago : #10199-R0-force 02days 06hrs ago : #10205-binutils-gcc-gdb-glibc-linux-R# build_abe check_gcc -- --set runtestflags=compile.exp --set runtestflags=execute.exp: 06days 23hrs ago : #10199-R0-force (bisect : gcc-advance-baseline) 6.0 regressed(13%) force(04%) fail(31%) ok(13%) skip(09%) nbruns=22
tcwg_gnu_native_fast_check_gcc--master-arm-build UNSTABLE (gdb) 02days 09hrs ago : #10219-binutils-gcc-gdb-glibc-linux-R# build_abe check_gcc -- --set runtestflags=compile.exp --set runtestflags=execute.exp: artifacts/results/ email/jira/ log/status 14days 01hrs ago : #10208-binutils-gdb-glibc-R0 02days 09hrs ago : #10219-binutils-gcc-gdb-glibc-linux-R# build_abe check_gcc -- --set runtestflags=compile.exp --set runtestflags=execute.exp: 15days 02hrs ago : #10205-gcc-R# 1 regressions-force (bisect : gcc-5f9f871) 6.0 regressed(04%) force(09%) fail(27%) ok(09%) skip(04%) nbruns=22
tcwg_gnu_native_fast_check_gdb--master-aarch64-build UNSTABLE (gcc) 01days 22hrs ago : #10199-binutils-gcc-gdb-glibc-linux-R# build_abe check_gdb -- --set runtestflags=gdb.base/break-always.exp --set runtestflags=gdb.base/break-caller-line.exp --set runtestflags=gdb.base/break-entry.exp --set runtestflags=gdb.base/break.exp --set runtestflags=gdb.base/break-fun-addr.exp --set runtestflags=gdb.base/break-idempotent.exp --set runtestflags=gdb.base/break-include.exp --set runtestflags=gdb.base/break-inline.exp --set runtestflags=gdb.base/break-main-file-remove-fail.exp --set runtestflags=gdb.base/break-on-linker-gcd-function.exp --set runtestflags=gdb.base/breakpoint-in-ro-region.exp --set runtestflags=gdb.base/breakpoint-shadow.exp --set runtestflags=gdb.base/break-probes.exp --set runtestflags=gdb.gdb/unittest.exp --set check_buffer_workaround=gdb-read1: artifacts/results/ email/jira/ log/status 08days 22hrs ago : #10192-binutils-gcc-gdb-glibc-linux-R0 01days 22hrs ago : #10199-binutils-gcc-gdb-glibc-linux-R# build_abe check_gdb -- --set runtestflags=gdb.base/break-always.exp --set runtestflags=gdb.base/break-caller-line.exp --set runtestflags=gdb.base/break-entry.exp --set runtestflags=gdb.base/break.exp --set runtestflags=gdb.base/break-fun-addr.exp --set runtestflags=gdb.base/break-idempotent.exp --set runtestflags=gdb.base/break-include.exp --set runtestflags=gdb.base/break-inline.exp --set runtestflags=gdb.base/break-main-file-remove-fail.exp --set runtestflags=gdb.base/break-on-linker-gcd-function.exp --set runtestflags=gdb.base/breakpoint-in-ro-region.exp --set runtestflags=gdb.base/breakpoint-shadow.exp --set runtestflags=gdb.base/break-probes.exp --set runtestflags=gdb.gdb/unittest.exp --set check_buffer_workaround=gdb-read1: never 6.0 regressed(00%) force(00%) fail(26%) ok(26%) skip(00%) nbruns=15
tcwg_gnu_native_fast_check_gdb--master-arm-build UNSTABLE (gcc) 02days 01hrs ago : #10199-binutils-gcc-gdb-glibc-linux-R# build_abe check_gdb -- --set runtestflags=gdb.base/break-always.exp --set runtestflags=gdb.base/break-caller-line.exp --set runtestflags=gdb.base/break-entry.exp --set runtestflags=gdb.base/break.exp --set runtestflags=gdb.base/break-fun-addr.exp --set runtestflags=gdb.base/break-idempotent.exp --set runtestflags=gdb.base/break-include.exp --set runtestflags=gdb.base/break-inline.exp --set runtestflags=gdb.base/break-main-file-remove-fail.exp --set runtestflags=gdb.base/break-on-linker-gcd-function.exp --set runtestflags=gdb.base/breakpoint-in-ro-region.exp --set runtestflags=gdb.base/breakpoint-shadow.exp --set runtestflags=gdb.base/break-probes.exp --set runtestflags=gdb.gdb/unittest.exp --set check_buffer_workaround=gdb-read1: artifacts/results/ email/jira/ log/status 14days 21hrs ago : #10189-binutils-gcc-gdb-glibc-linux-R0 02days 01hrs ago : #10199-binutils-gcc-gdb-glibc-linux-R# build_abe check_gdb -- --set runtestflags=gdb.base/break-always.exp --set runtestflags=gdb.base/break-caller-line.exp --set runtestflags=gdb.base/break-entry.exp --set runtestflags=gdb.base/break.exp --set runtestflags=gdb.base/break-fun-addr.exp --set runtestflags=gdb.base/break-idempotent.exp --set runtestflags=gdb.base/break-include.exp --set runtestflags=gdb.base/break-inline.exp --set runtestflags=gdb.base/break-main-file-remove-fail.exp --set runtestflags=gdb.base/break-on-linker-gcd-function.exp --set runtestflags=gdb.base/breakpoint-in-ro-region.exp --set runtestflags=gdb.base/breakpoint-shadow.exp --set runtestflags=gdb.base/break-probes.exp --set runtestflags=gdb.gdb/unittest.exp --set check_buffer_workaround=gdb-read1: never 6.0 regressed(00%) force(00%) fail(26%) ok(13%) skip(00%) nbruns=15

time to build html = 0:03:57.675518